program: Gaussian 09
title: 000198460
version: EM64L-G09RevD.01
frameworkgroup: C1[X(C8H20N2)]
method: RPBEPBE
basis: SDD
operation: Freq
keyword: #pfreq=noraman
keyword: PBEPBE/SDD
title: #p freq=noraman PBEPBE/SDD
converged: YES YES NO NO
title: Mulliken charges:
elementType: N N C C C C C C C C H H H H H H H H H H H H H H H H H H H H
charge: -0.297971 -0.096759 -0.420610 -0.365872 -0.327123 -0.048037 -0.702144 -0.688159 -0.617347 -0.612054 0.194339 0.188598 0.184790 0.232722 0.178368 0.231834 0.207355 0.228944 0.204478 0.195694 0.234285 0.228796 0.209861 0.197809 0.223459 0.184095 0.220154 0.184202 0.230594 0.215699
chargesum: 0.00000
title: Mulliken charges with hydrogens summed into heavy atoms:
elementType: N N C C C C C C C C
charge: -0.069027 -0.096759 -0.037673 0.051640 0.083078 0.159318 -0.067687 -0.051693 0.010361 0.018442
polarizability: 1.17844298e+02 -2.04995114e+00 9.92450310e+01 -2.66285875e-01 -3.92507954e-01 9.18039108e+01
1716.lowfreq: -20.6642 -11.8856 -0.0008 -0.0004 0.0007 13.1825 33.9617 35.2336 40.7909
frequency: 33.5550 34.6646 40.0611 90.6401 154.3008 159.8651 212.1524 219.2154 233.5089 238.5546 260.8757 304.3756 335.1522 364.5607 398.2765 413.8415 450.7602 453.6442 519.0382 645.1137 742.1236 823.4979 838.6314 884.7832 906.0386 909.3994 934.7258 971.6252 1018.5524 1032.9836 1055.2324 1076.9558 1092.3050 1104.1717 1125.7769 1131.2640 1142.7718 1174.9241 1180.9142 1234.9015 1260.4491 1267.3157 1295.7801 1307.5981 1322.7885 1350.4174 1351.6250 1364.3925 1375.3503 1385.0954 1415.1414 1434.6225 1437.4511 1456.5885 1460.6165 1463.0083 1463.3289 1467.7815 1475.8163 1477.2529 1479.6255 1481.7524 1485.1923 1485.7159 2837.2275 2838.0017 2857.9634 2876.5545 2963.8210 2971.7669 2975.2205 2978.5417 3013.3295 3017.2984 3021.6111 3029.4683 3041.9222 3057.5934 3068.2105 3069.5686 3074.6612 3080.2418 3091.8115 3405.5842
redmass: 2.7931 3.2506 2.6028 2.9151 2.2725 2.5545 1.0437 1.5703 1.1321 1.3402 1.1507 2.1008 2.3935 1.9820 2.1327 2.0414 2.2135 2.2536 2.5948 1.5410 2.5327 2.2007 1.8687 2.1894 2.0120 1.2434 1.4084 1.6563 2.0172 1.5077 1.8361 1.9114 1.4936 1.8943 1.9451 1.5975 1.7268 1.9588 1.9940 1.7686 1.7122 2.0606 1.2883 1.4236 1.2378 1.4077 1.3523 1.2597 1.3021 1.2257 1.1407 1.1588 1.1616 1.0775 1.0535 1.0549 1.0494 1.0931 1.0516 1.0797 1.0738 1.0729 1.0558 1.0578 1.0576 1.0671 1.0609 1.0702 1.0357 1.0440 1.0615 1.0775 1.0721 1.0900 1.0729 1.0914 1.0927 1.0988 1.0974 1.0996 1.1004 1.0999 1.0999 1.0736
irintensity: 0.0214 0.2457 0.6808 0.0149 3.3730 1.5999 0.4061 2.3885 1.0660 0.6938 0.9890 7.3434 1.1773 8.6647 0.2723 1.1693 1.5407 5.0464 4.8355 104.3618 9.0549 8.0234 8.4480 1.5886 7.5896 4.3560 1.7438 9.4907 25.9512 11.2019 19.4969 0.5839 5.9834 19.6259 14.5398 20.4028 10.9356 97.3888 17.0249 5.7738 0.3198 14.1684 7.3093 4.2220 4.3075 6.4155 7.2117 22.0461 5.2611 24.7439 2.2947 10.7310 10.2148 8.6391 13.6222 6.1791 2.2838 6.0012 10.4609 19.8971 9.0742 6.1817 9.9994 25.7854 78.0921 46.5139 314.5039 89.4687 30.9196 25.7611 55.6682 24.0949 36.2095 13.5230 42.3071 36.1100 40.1096 9.5863 88.8123 43.6540 35.4063 47.5711 38.8110 3.2955
temp: 298.150 k
press: 1.00000 atm
elementType: 7 7 6 6 6 6 6 6 6 6 1 1 1 1 1 1 1 1 1 1 1 1 1 1 1 1 1 1 1 1
symmnumber: 1
zpe: 717632.8 jmol-1
zpe.correction: 0.273332 hartree
zpe.thermalcorrener: 0.286906 hartree
zpe.thermalcorrenthalpy: 0.287850 hartree
zpe.thermalcorrgfe: 0.232424 hartree
zpe.sumelectzpe: -425.452044 hartree
zpe.sumelectthermal: -425.438470 hartree
zpe.sumelectthermalent: -425.437526 hartree
zpe.sumelectthermalfe: -425.492951 hartree
dipole: -0.0367 -0.4629 0.2535
dipole: 0.5291
quadrupole: -61.7935 -64.3490 -65.3983
quadrupole: 0.5604 -0.8764 -1.6154
quadrupole: 2.0535 -0.5021 -1.5514 0.5604 -0.8764 -1.6154
hfenergy: -425.725376 hartree
pointgroup: C01 [X(C8H20N2)]
dipole: -0.017025 -0.1681315 0.1215302 debye
polarizability: 116.8627974|-3.9869954|99.6678719|-3.1186756|-0.700092|92.3625705 unknown
InChI: InChI=1S/C8H20N2/c1-8(2)9-6-5-7-10(3)4/h8-9H,5-7H2,1-4H3
charge 0 multiplicity 1
30 atoms
N  -1.292016 -0.014895 0.706114
N  2.306921 0.095594 -0.634062
C  0.814916 -1.337097 0.810609
C  -0.497267 -1.072553 0.040198
C  1.781441 -0.135575 0.735799
C  -2.375121 0.617667 -0.090846
C  -2.939914 1.815444 0.700512
C  -3.511544 -0.356748 -0.513009
C  3.334859 -0.884093 -1.03531
C  2.769663 1.48316 -0.834596
H  1.293908 -2.252268 0.410197
H  0.587166 -1.543912 1.877143
H  -1.0525 -2.034133 -0.083332
H  -0.230852 -0.711644 -0.971646
H  2.614297 -0.27064 1.474082
H  1.20788 0.760464 1.036525
H  -1.894115 1.003899 -1.012887
H  -1.641716 -0.324519 1.625911
H  -3.712484 2.34982 0.118056
H  -3.407368 1.474587 1.645733
H  -2.131174 2.522488 0.954117
H  -3.109476 -1.223706 -1.068307
H  -4.249073 0.150227 -1.163707
H  -4.048024 -0.736595 0.37881
H  2.937303 -1.91098 -0.962211
H  4.262093 -0.829178 -0.407014
H  3.624799 -0.710142 -2.087582
H  3.648377 1.759035 -0.195726
H  1.947728 2.184301 -0.606159
H  3.062796 1.629793 -1.890709
