program: Gaussian 09
title: 000198492
version: EM64L-G09RevD.01
frameworkgroup: C1[X(C12H18N4O2S2)]
method: RPBEPBE
basis: SDD
operation: Freq
keyword: #p
keyword: freq=noraman
keyword: PBEPBE/SDD
title: #p freq=noraman PBEPBE/SDD
converged: YES YES NO NO
title: Mulliken charges:
elementType: S S O O N N N N C C C C C C C C C C C C H H H H H H H H H H H H H H H H H H
charge: 0.288545 0.288564 -0.254601 -0.254610 -0.113982 -0.113987 -0.100539 -0.100582 -0.293260 -0.293241 -0.701818 -0.701842 -0.080306 -0.080299 -0.630625 -0.630621 -0.508278 -0.508263 0.118063 0.118084 0.240262 0.231033 0.240259 0.231036 0.278871 0.262637 0.278871 0.262645 0.227070 0.292519 0.227560 0.227557 0.227071 0.292525 0.242023 0.274829 0.242031 0.274796
chargesum: 0.00000
title: Mulliken charges with hydrogens summed into heavy atoms:
elementType: S S O O N N N N C C C C C C C C C C C C
charge: 0.288545 0.288564 -0.254601 -0.254610 -0.113982 -0.113987 -0.100539 -0.100582 0.178035 0.178054 -0.160310 -0.160325 -0.080306 -0.080299 0.116524 0.116533 0.008574 0.008564 0.118063 0.118084
polarizability: 3.49878569e+02 -3.11546664e+00 1.99233414e+02 1.88303158e-02 1.94295936e-03 1.17188554e+02
1716.lowfreq: -3.1831 -0.0012 0.0012 0.0015 4.0247 9.0621 12.8006 18.5066 26.4657
frequency: 12.7925 18.4471 26.4052 53.8013 62.9505 84.6442 96.5679 113.8863 118.6104 132.2925 132.4974 139.8694 148.1372 149.5450 174.9775 180.1712 183.6776 249.4654 251.5776 270.5809 285.9636 305.7776 378.5661 393.8711 413.5832 470.4042 482.4207 498.6990 505.2954 547.8210 559.0199 613.9187 615.7358 624.7940 628.9582 652.0531 664.6067 686.3132 720.6802 797.9648 820.9271 837.5665 899.4100 910.1252 928.8730 941.5483 999.8948 1001.0043 1004.5790 1005.5180 1013.4895 1060.0910 1069.6610 1090.5193 1112.8967 1113.0214 1136.7246 1147.8141 1154.0874 1171.3274 1176.1016 1193.6879 1205.7590 1232.3585 1236.0373 1236.0944 1273.6933 1278.0141 1294.6224 1312.8885 1333.6026 1367.0118 1391.1193 1397.8006 1413.2818 1414.3952 1437.3674 1442.7795 1452.1417 1452.2013 1470.5538 1470.8245 1477.3811 1478.9272 1485.2331 1485.9405 1528.0707 1536.2140 1581.7431 1589.9851 2955.5077 2955.5752 2968.4320 2968.5954 2990.4605 2995.7457 3036.8390 3036.8690 3041.4350 3049.7670 3049.7956 3053.7428 3053.7924 3061.9778 3119.7495 3119.7516 3134.3184 3134.3259
redmass: 5.0106 5.0043 5.2141 5.9142 5.3194 2.4752 5.9894 2.5345 2.1915 2.2206 2.1807 4.1597 1.6554 1.8198 6.5298 2.5205 2.6322 3.4789 3.6072 3.5836 6.3770 4.8847 7.6113 5.0678 4.1658 7.7027 5.4638 4.4672 4.3932 2.3662 3.8028 6.6988 5.4514 6.8306 4.9761 7.0159 4.8839 5.5297 3.8422 1.8718 1.9236 1.8401 2.8966 2.6455 4.3639 4.5453 1.7038 1.4946 2.0167 2.3740 2.2834 2.8161 2.0166 2.2617 1.2349 1.2359 1.2954 1.6098 1.4611 1.4957 1.4855 1.4832 1.9179 1.3393 2.3593 2.1016 1.6395 1.5966 1.4766 1.6224 1.9375 2.1033 2.7664 2.5386 1.2016 1.2286 1.1269 1.1281 1.0988 1.0990 1.0844 1.0833 1.1523 1.1297 1.0871 1.1049 6.7135 6.1606 5.1670 5.8142 1.0647 1.0646 1.0383 1.0384 1.0646 1.0633 1.0885 1.0884 1.0938 1.0996 1.0996 1.0669 1.0669 1.0965 1.0983 1.0983 1.1084 1.1084
irintensity: 6.5302 0.1740 3.9692 0.2442 3.7594 0.5691 4.0459 3.2765 0.3107 0.3936 3.4987 2.4380 0.9345 3.3382 25.0701 1.1534 2.6275 4.3343 4.9978 12.3190 0.4427 0.4095 64.3555 0.8273 18.8095 0.0224 21.5421 0.2762 14.4037 0.4123 26.8659 8.5233 3.2141 3.9719 11.5517 57.6369 0.0159 1.8558 0.0578 15.5650 36.0230 0.8869 2.4197 11.9358 173.5404 0.0083 0.3810 12.4510 1.1243 18.9987 13.6603 0.9362 205.3080 0.3698 0.1602 3.4654 0.2552 102.4048 0.5504 104.0496 0.0531 204.0643 0.8489 208.9942 4.2549 180.1891 4.4930 7.5724 151.3855 0.1256 191.4048 0.1555 509.7345 0.8207 229.2595 2.6320 3.1383 95.0858 29.7860 3.4489 16.2288 4.4487 135.8977 27.4503 39.9721 8.2857 287.2555 26.2349 1349.7352 0.1847 78.4745 31.9511 202.1038 1.2794 0.1611 72.3615 11.8090 11.3025 3.7944 3.5759 62.6055 61.5747 27.1106 14.7327 1.0991 0.7679 4.1149 20.2173
temp: 298.150 k
press: 1.00000 atm
elementType: 16 16 8 8 7 7 7 7 6 6 6 6 6 6 6 6 6 6 6 6 1 1 1 1 1 1 1 1 1 1 1 1 1 1 1 1 1 1
symmnumber: 1
zpe: 779001.8 jmol-1
zpe.correction: 0.296706 hartree
zpe.thermalcorrener: 0.318554 hartree
zpe.thermalcorrenthalpy: 0.319499 hartree
zpe.thermalcorrgfe: 0.242057 hartree
zpe.sumelectzpe: -1632.132459 hartree
zpe.sumelectthermal: -1632.110611 hartree
zpe.sumelectthermalent: -1632.109667 hartree
zpe.sumelectthermalfe: -1632.187108 hartree
dipole: 0.0016 0.0018 2.3890
dipole: 2.3890
quadrupole: -35.4820 -134.7081 -133.7647
quadrupole: -22.2756 0.0085 0.0016
quadrupole: 65.8362 -33.3898 -32.4464 -22.2756 0.0085 0.0016
hfenergy: -1632.4291652 hartree
pointgroup: C01 [X(C12H18N4O2S2)]
dipole: -0.0000073 -0.9398946 -0.001629 debye
polarizability: 349.3817192|0.1523039|117.1887156|9.1811452|-0.0661767|199.7301023 unknown
InChI: InChI=1S/C12H18N4O2S2/c1-15-5-7-19-11(15)13-9(17)3-4-10(18)14-12-16(2)6-8-20-12/h3-8H2,1-2H3
charge 0 multiplicity 1
38 atoms
S  4.637775 -0.002496 1.936322
S  -4.637742 -0.00455 -1.935681
O  1.92063 0.264743 1.523959
O  -1.92105 0.265978 -1.521838
N  5.424307 -0.614298 -0.558093
N  -5.42423 -0.621915 0.557368
N  3.073954 -0.46842 -0.407118
N  -3.074045 -0.472342 0.407479
C  6.701293 -0.324384 0.128446
C  -6.701467 -0.332898 -0.12907
C  6.460836 -0.511364 1.635144
C  -6.460175 -0.516548 -1.636058
C  4.267139 -0.3906 0.152932
C  -4.267174 -0.395034 -0.152808
C  5.411534 -0.84387 -2.009144
C  -5.41161 -0.85417 2.007995
C  0.626651 -0.452424 -0.441896
C  -0.626713 -0.453489 0.442901
C  1.908717 -0.194028 0.333769
C  -1.908927 -0.195127 -0.332545
H  7.022099 0.714631 -0.098284
H  7.48047 -1.014728 -0.243021
H  -7.024153 0.705105 0.099599
H  -7.479581 -1.025321 0.24077
H  6.573841 -1.561243 1.946411
H  7.103681 0.14037 2.243861
H  -6.571624 -1.565966 -1.949421
H  -7.103739 0.135474 -2.243707
H  5.822645 0.030867 -2.550978
H  4.36668 -0.998191 -2.317412
H  6.014076 -1.735738 -2.261174
H  -6.012858 -1.747437 2.25816
H  -5.824279 0.018926 2.551288
H  -4.36663 -1.007439 2.316359
H  0.738343 -1.396424 -1.005494
H  0.527218 0.332517 -1.218767
H  -0.737671 -1.398265 1.005325
H  -0.527923 0.330595 1.22072
