program: Gaussian 09
title: 000198478
version: EM64L-G09RevD.01
frameworkgroup: C1[X(C13H13F3N2O4)]
method: RPBEPBE
basis: SDD
operation: Freq
keyword: #p
keyword: freq=noraman
keyword: PBEPBE/SDD
title: #p freq=noraman PBEPBE/SDD
converged: YES YES NO NO
title: Mulliken charges:
elementType: F F F O O O O N N C C C C C C C C C C C C C H H H H H H H H H H H H H
charge: -0.164816 -0.164284 -0.171620 -0.247347 -0.296315 -0.235796 -0.304187 -0.289063 -0.372656 -0.069578 -0.437974 -0.331846 0.448185 0.250180 -0.468216 -0.343287 0.312590 -0.206961 -0.371600 0.250315 0.331183 -0.607143 0.257817 0.311525 0.248852 0.259868 0.242658 0.278937 0.308358 0.238784 0.265580 0.333890 0.236279 0.273469 0.234219
chargesum: 0.00000
title: Mulliken charges with hydrogens summed into heavy atoms:
elementType: F F F O O O O N N C C C C C C C C C C C C C
charge: -0.164816 -0.164284 -0.171620 -0.247347 -0.296315 -0.235796 -0.304187 -0.289063 -0.038766 0.188239 0.122403 0.170680 0.448185 0.250180 -0.189279 -0.034929 0.312590 0.031823 -0.106020 0.250315 0.331183 0.136824
polarizability: 2.15707394e+02 -2.01312146e+00 1.93323219e+02 2.20239510e+01 -1.11954237e+01 1.00346234e+02
1716.lowfreq: -5.5546 -3.4650 -0.0012 -0.0009 -0.0007 7.0374 12.1014 17.4259 22.1516
frequency: 12.0747 17.3775 22.0179 27.3766 51.7488 83.2470 87.9702 100.0252 107.9994 124.9159 143.0053 166.5789 193.2943 213.8947 248.9286 270.7716 277.5099 281.0131 307.5577 332.9127 344.6837 359.5875 402.1340 421.1454 430.4655 488.6485 507.3317 529.1949 565.5187 596.4396 608.6990 622.5265 628.3696 649.3067 676.6411 694.6593 695.1985 702.3750 742.0202 766.9012 811.2461 844.1274 869.7598 884.7170 928.6167 931.2064 944.1121 965.5473 979.9830 983.2983 984.8534 1001.9366 1013.0193 1050.2855 1073.7243 1097.2557 1098.7785 1113.6462 1126.3419 1127.3500 1146.7766 1183.4201 1196.1572 1205.5899 1216.2459 1247.4925 1265.8177 1278.5217 1324.1635 1327.3945 1340.3764 1369.5960 1375.7249 1397.0428 1431.8214 1450.9723 1453.9319 1464.8246 1483.8046 1491.2114 1502.2733 1519.5822 1593.8744 1624.2334 1680.8090 1696.5190 2986.7307 2987.5733 3031.0736 3058.7587 3067.3349 3074.9450 3118.7489 3119.0223 3151.4775 3175.8546 3181.1269 3190.8626 3572.9009
redmass: 11.8743 6.1981 5.9063 5.8772 5.7500 7.9344 3.9262 4.7242 1.2148 6.4497 6.0218 3.6468 4.5894 4.5858 8.1526 5.1459 6.0182 5.1117 7.1050 4.8266 8.1189 5.6367 7.6306 2.6626 4.8762 4.9734 8.0363 6.2151 5.1999 1.1180 12.0855 6.5362 5.3594 8.0030 11.2578 6.7501 2.5635 9.0928 6.8242 8.4297 1.4068 3.5332 2.9807 1.6006 3.8148 1.4881 2.2509 6.3071 3.2651 5.7620 10.3972 1.3450 6.3795 6.1985 2.6210 4.2296 2.3549 1.7373 1.8082 1.4843 1.6737 3.3453 1.1164 2.1219 1.3026 1.1566 2.9410 1.2931 1.2997 2.6613 1.4252 2.1174 1.3419 4.9516 1.1620 1.1397 3.1869 1.2714 1.0440 2.2929 1.1759 1.4539 6.3672 5.9393 8.6845 11.7859 1.0392 1.0564 1.0609 1.1026 1.1029 1.0907 1.1007 1.1044 1.0884 1.0948 1.0916 1.0963 1.0773
irintensity: 0.3257 0.6914 3.9046 0.1077 0.4556 4.9877 5.5277 3.9930 1.5363 1.3344 2.5146 2.5595 1.4600 10.7942 0.9723 6.7578 2.9242 1.0702 1.0912 29.3401 4.4342 8.8986 6.0256 3.1686 1.2579 4.4220 1.4226 0.7250 4.7478 132.1331 15.6647 2.8160 3.9832 25.3475 9.8690 8.9757 46.9367 8.0630 10.4086 25.4182 69.5242 6.3414 20.1207 36.7833 21.5794 4.4854 62.4698 79.5949 19.7099 59.5776 200.8801 5.7449 111.8798 405.4709 22.8715 183.0426 39.9842 12.4929 30.4761 11.5945 25.5222 98.9349 1.7315 194.3843 78.4491 33.8566 178.5741 3.3937 8.3109 217.5087 44.5358 63.6112 7.4239 8.3867 34.8928 16.8509 122.5651 117.9282 16.2497 126.3365 6.5193 154.6675 22.6634 75.8007 404.0049 370.3582 59.0459 30.5132 12.5192 3.3879 31.4611 28.9748 1.3086 9.3414 8.5600 3.6319 3.0149 6.9201 52.4085
temp: 298.150 k
press: 1.00000 atm
elementType: 9 9 9 8 8 8 8 7 7 6 6 6 6 6 6 6 6 6 6 6 6 6 1 1 1 1 1 1 1 1 1 1 1 1 1
symmnumber: 1
zpe: 665820.3 jmol-1
zpe.correction: 0.253598 hartree
zpe.thermalcorrener: 0.274410 hartree
zpe.thermalcorrenthalpy: 0.275354 hartree
zpe.thermalcorrgfe: 0.199383 hartree
zpe.sumelectzpe: -1211.512411 hartree
zpe.sumelectthermal: -1211.491599 hartree
zpe.sumelectthermalent: -1211.490655 hartree
zpe.sumelectthermalfe: -1211.566626 hartree
dipole: 5.3480 -2.3156 1.0818
dipole: 5.9273
quadrupole: -100.6859 -145.0411 -126.2847
quadrupole: -25.5449 6.7873 -2.8591
quadrupole: 23.3180 -21.0372 -2.2808 -25.5449 6.7873 -2.8591
hfenergy: -1211.766009 hartree
pointgroup: C01 [X(C13H13F3N2O4)]
dipole: -2.198438 -0.5655692 -0.5340594 debye
polarizability: 215.3524875|-4.421793|189.007903|24.0928739|20.888127|105.0164566 unknown
InChI: InChI=1S/C13H13F3N2O4/c1-17-11(19)21-7-10-6-18(12(20)22-10)9-4-2-3-8(5-9)13(14,15)16/h2-5,10,17H,6-7H2,1H3
charge 0 multiplicity 1
35 atoms
F  4.279273 -2.627702 -0.86997
F  2.607905 -3.286881 0.505755
F  2.137468 -2.690728 -1.62667
O  -1.69388 3.159175 -0.111802
O  -4.355251 0.560021 0.020552
O  0.355541 3.855588 0.75706
O  -3.020541 -1.305724 0.610263
N  -0.003548 1.616655 -0.023174
N  -5.197487 -1.530936 -0.25541
C  -2.309396 1.863254 -0.524546
C  -1.107978 0.892924 -0.694332
C  -3.329587 1.477271 0.565043
C  1.270743 1.019003 0.184755
C  -0.340951 2.949413 0.265707
C  1.486995 -0.309948 -0.263161
C  2.332218 1.718091 0.827789
C  2.745216 -0.919679 -0.070958
C  3.578322 1.086917 1.007588
C  3.803055 -0.234189 0.565695
C  2.94042 -2.342461 -0.510206
C  -4.099442 -0.82977 0.166096
C  -5.238994 -2.997273 -0.248836
H  -2.842425 2.044719 -1.471907
H  -1.320693 -0.072687 -0.205097
H  -0.863907 0.721767 -1.759721
H  -3.887797 2.377038 0.866504
H  -2.83551 1.018188 1.439854
H  0.696615 -0.872451 -0.765571
H  2.174509 2.74387 1.166296
H  4.385934 1.638145 1.499729
H  4.775069 -0.716577 0.700244
H  -6.007788 -0.992118 -0.563208
H  -6.033903 -3.370076 0.422363
H  -4.268047 -3.365293 0.117682
H  -5.410456 -3.395547 -1.265305
