program: Gaussian 09
title: 000198461
version: EM64L-G09RevD.01
frameworkgroup: C1[X(C12H16O3)]
method: RPBEPBE
basis: SDD
operation: Freq
keyword: #pfreq=noraman
keyword: PBEPBE/SDD
title: #p freq=noraman PBEPBE/SDD
converged: YES YES NO NO
title: Mulliken charges:
elementType: O O O C C C C C C C C C C C C H H H H H H H H H H H H H H H H
charge: -0.286545 -0.441899 -0.433228 -0.173071 -0.310500 0.284557 0.206002 -0.570147 -0.296670 -0.355392 -0.351919 -0.254076 -0.245425 -0.040320 -0.594327 0.261228 0.186505 0.239698 0.233755 0.233021 0.167933 0.241817 0.252151 0.245510 0.227224 0.225800 0.228349 0.334417 0.349097 0.215394 0.221060
chargesum: 0.00000
title: Mulliken charges with hydrogens summed into heavy atoms:
elementType: O O O C C C C C C C C C C C C
charge: -0.286545 -0.107482 -0.084131 0.088157 0.115703 0.284557 0.206002 -0.103371 0.113081 -0.103241 -0.106409 -0.026852 -0.019625 0.188029 -0.157873
polarizability: 1.75705216e+02 -8.41891482e+00 1.60251255e+02 -2.09798678e+00 -1.08549887e+01 8.64904878e+01
1716.lowfreq: -6.7807 -0.0003 0.0003 0.0006 5.5523 9.1992 26.5760 39.3504 47.6603
frequency: 26.1272 39.2538 47.6349 58.3967 82.1516 113.2487 128.0245 154.0719 192.8375 215.2609 244.4682 251.4393 291.2678 344.5765 361.0415 393.4575 441.6407 449.3401 486.6776 505.7188 526.8152 538.2235 546.6864 601.8856 649.8808 714.8774 758.7306 779.8313 814.4031 821.3170 848.4375 902.4068 916.9475 937.7720 943.2437 950.4331 978.6958 991.0258 991.8542 1017.6947 1018.9930 1046.8861 1075.1770 1095.5867 1119.8120 1125.8444 1154.0198 1173.3868 1180.3953 1188.3824 1214.2239 1224.4793 1248.3095 1272.2177 1288.4748 1300.3812 1304.6542 1334.2897 1358.9965 1374.8984 1387.7689 1391.7101 1425.7389 1435.0640 1453.7882 1467.4684 1472.7500 1488.5797 1594.8516 1607.0231 1658.9494 2911.3567 2930.5276 2973.9873 3018.5527 3019.7666 3080.4197 3082.0720 3093.9931 3098.1876 3128.3106 3137.7893 3153.5654 3167.4594 3195.7707 3512.4375 3518.9819
redmass: 4.1603 4.2378 3.3584 3.9392 3.2560 3.2942 3.8156 3.1562 3.9229 3.1105 4.1454 3.9427 3.5511 1.9005 1.6644 2.3877 2.4753 2.8179 1.8265 1.4362 3.8059 3.5559 2.7157 5.8810 2.2293 2.6626 1.4548 4.3930 3.5021 3.1950 1.3847 1.5238 1.7211 1.7688 1.3785 1.5592 1.3140 3.9894 3.5427 1.2907 2.1407 2.1210 2.1984 2.4499 1.7422 1.7704 1.3507 1.1278 1.6924 1.1465 1.4238 2.6359 1.4194 1.5934 1.2540 1.2341 1.4481 1.2982 1.2440 1.4426 1.3881 3.7498 1.2600 1.8534 1.1787 1.0923 1.3029 1.8333 6.9265 6.4205 4.7553 1.0716 1.0616 1.0599 1.0989 1.0981 1.0695 1.0864 1.0837 1.0916 1.0850 1.0900 1.0935 1.1002 1.1144 1.0652 1.0657
irintensity: 1.2923 0.4253 0.0618 2.9352 0.9338 13.5800 0.9027 2.9438 2.8645 1.4817 0.3321 8.7333 1.3444 14.9646 59.9792 10.8323 6.1359 5.5095 36.4791 189.6219 0.8429 7.5581 6.0797 7.2728 16.0023 12.1108 88.9867 4.2125 4.0891 42.3584 3.3524 7.2848 6.6556 8.5201 22.9816 51.5952 0.5081 52.8536 76.5481 23.4128 118.7673 19.1431 3.2882 53.9730 3.0957 23.8312 76.1374 13.1523 17.8045 1.7885 59.1532 125.1377 27.9070 9.9913 0.5304 6.7327 2.7605 20.9462 18.3422 9.6412 17.7395 7.7842 3.8516 21.6602 44.8361 4.0840 53.6344 29.2457 12.8572 26.1728 19.5313 64.1825 59.4172 14.0012 23.7629 12.0658 18.4101 13.4533 7.3991 24.2092 0.4999 10.2570 30.2841 19.0740 28.2506 14.1864 3.5119
temp: 298.150 k
press: 1.00000 atm
elementType: 8 8 8 6 6 6 6 6 6 6 6 6 6 6 6 1 1 1 1 1 1 1 1 1 1 1 1 1 1 1 1
symmnumber: 1
zpe: 667301.4 jmol-1
zpe.correction: 0.254162 hartree
zpe.thermalcorrener: 0.269923 hartree
zpe.thermalcorrenthalpy: 0.270868 hartree
zpe.thermalcorrgfe: 0.209243 hartree
zpe.sumelectzpe: -691.349849 hartree
zpe.sumelectthermal: -691.334087 hartree
zpe.sumelectthermalent: -691.333143 hartree
zpe.sumelectthermalfe: -691.394767 hartree
dipole: -0.5222 -3.1021 1.1607
dipole: 3.3531
quadrupole: -90.5489 -90.0470 -91.4372
quadrupole: -12.0364 4.0290 -4.4377
quadrupole: 0.1288 0.6307 -0.7595 -12.0364 4.0290 -4.4377
hfenergy: -691.6040105 hartree
pointgroup: C01 [X(C12H16O3)]
dipole: 0.5235814 1.1313914 0.4314188 debye
polarizability: 167.9572256|-11.309406|167.2996054|12.9718977|3.6305338|87.1901282 unknown
InChI: InChI=1S/C12H16O3/c1-2-5-10-6-3-4-7-12(10)15-9-11(14)8-13/h2-4,6-7,11,13-14H,1,5,8-9H2
charge 0 multiplicity 1
31 atoms
O  -0.702808 0.34462 -0.212381
O  -3.958502 2.02683 -0.881316
O  -4.884936 -0.488864 0.123845
C  -3.00735 0.91238 -0.639394
C  -1.61211 1.485534 -0.354647
C  1.49003 -0.536635 0.187078
C  0.661234 0.613885 0.042622
C  0.890503 -1.935319 0.049428
C  -3.554717 0.00532 0.47435
C  2.865859 -0.328392 0.432332
C  1.190505 1.921256 0.147261
C  3.413229 0.972489 0.536655
C  2.571958 2.095243 0.394701
C  1.669061 -3.022571 0.760819
C  2.131146 -4.158749 0.18126
H  -3.0070 0.361325 -1.593889
H  -1.617642 2.087693 0.582481
H  -1.300244 2.135108 -1.19619
H  -0.145558 -1.907144 0.441243
H  0.793223 -2.1896 -1.025115
H  -3.574008 0.568469 1.43766
H  -2.914998 -0.88221 0.598592
H  3.514243 -1.205765 0.536993
H  0.54968 2.800827 0.034346
H  4.483857 1.104363 0.725001
H  2.981946 3.108246 0.472955
H  1.835972 -2.862949 1.837641
H  -3.968651 2.620815 -0.084565
H  -5.386205 0.275836 -0.266709
H  2.659034 -4.925361 0.759588
H  1.991045 -4.355377 -0.889246
