program: Gaussian 09
title: 000198423
version: EM64L-G09RevD.01
frameworkgroup: C1[X(C3H8N2O)]
method: RPBEPBE
basis: SDD
operation: Freq
keyword: #pfreq=noraman
keyword: PBEPBE/SDD
title: #p freq=noraman PBEPBE/SDD
converged: NO YES NO NO
title: Mulliken charges:
elementType: O N N C C C H H H H H H H H
charge: -0.219666 -0.529724 -0.529726 -0.469379 -0.469380 0.159322 0.234931 0.235069 0.235035 0.234965 0.279666 0.279610 0.279648 0.279629
chargesum: 0.00000
title: Mulliken charges with hydrogens summed into heavy atoms:
elementType: O N N C C C
charge: -0.219666 0.029553 0.029551 0.000620 0.000620 0.159322
polarizability: 5.48994115e+01 -3.85604714e-05 5.03809300e+01 -2.99898996e-03 6.15208725e-03 4.01778218e+01
1716.lowfreq: -54.5973 -4.7912 -0.0006 0.0001 0.0002 7.1299 15.1436 53.4523 136.1091
frequency: -54.5585 53.1747 136.0914 178.6313 187.4564 288.4714 387.8112 446.9588 630.2861 707.2576 726.7905 752.7898 846.5131 915.5204 998.1525 1079.5469 1142.5157 1144.0332 1178.3281 1309.6968 1319.0961 1322.5844 1338.7146 1419.8027 1430.5790 1635.5796 1660.3217 1661.4709 2963.5499 2974.0289 3013.0128 3024.1516 3449.8638 3450.3986 3565.4720 3565.5744
redmass: 1.3478 2.2075 1.3653 1.2478 3.7122 4.3281 3.9743 1.8347 2.3364 1.4781 2.2552 1.3102 5.8009 1.4675 5.0905 1.0521 3.0052 3.7558 1.4476 1.3041 1.4784 1.2313 1.1836 1.0972 1.0990 8.3583 1.0818 1.0880 1.0600 1.0613 1.0992 1.0998 1.0460 1.0459 1.0955 1.0954
irintensity: 0.0000 23.0571 119.7275 0.0005 0.5772 56.2977 0.8675 11.0879 122.3361 16.0804 439.3489 0.0026 10.3464 3.3732 27.1711 0.0000 1.0937 10.8112 0.6133 25.3114 5.2898 0.0003 1.7183 0.0806 38.8979 69.4649 3.1570 74.4258 16.3696 40.5728 0.0006 32.9418 2.8459 0.1454 0.0154 4.1028
temp: 298.150 k
press: 1.00000 atm
elementType: 8 7 7 6 6 6 1 1 1 1 1 1 1 1
symmnumber: 1
zpe: 304474.9 jmol-1
zpe.correction: 0.115968 hartree
zpe.thermalcorrener: 0.123248 hartree
zpe.thermalcorrenthalpy: 0.124192 hartree
zpe.thermalcorrgfe: 0.084451 hartree
zpe.sumelectzpe: -303.321130 hartree
zpe.sumelectthermal: -303.313850 hartree
zpe.sumelectthermalent: -303.312906 hartree
zpe.sumelectthermalfe: -303.352647 hartree
dipole: 0.0000 -0.8112 -0.0052
dipole: 0.8112
quadrupole: -46.2623 -38.7086 -32.1080
quadrupole: 0.0000 -0.0111 0.0136
quadrupole: -7.2360 0.3177 6.9183 0.0000 -0.0111 0.0136
hfenergy: -303.4370983 hartree
pointgroup: C01 [X(C3H8N2O1)]
dipole: 0.0002118 -0.2965814 -0.1178658 debye
dipolederiv: -0.5854373 0.0001843 0.0000659 0.0002194 -0.7867861 -0.2036296 -0.0000189 -0.2031302 -0.3671838 -0.9775024 0.0521189 0.0219215 0.0811291 -0.3607455 -0.0635937 0.0341036 -0.0635465 -0.2295533 -0.9773042 -0.0529169 -0.0221377 -0.0817778 -0.3606952 -0.0639745 -0.0346828 -0.063779 -0.2298123 0.2705187 0.1826352 0.0734181 0.2557291 0.1245171 -0.0289201 0.1034383 -0.0285648 0.1836352 0.271177 -0.1822554 -0.0737699 -0.2552279 0.1238907 -0.028939 -0.1040982 -0.0288662 0.1836071 0.6672631 -0.0002104 0.0001775 -0.0002066 0.7366164 0.2897577 0.0001704 0.2892766 0.1396041 0.0248945 -0.0125091 -0.0464702 -0.0244291 0.0975316 -0.0428072 -0.0503586 -0.0847722 -0.1051244 0.0252205 -0.0407154 0.0247051 -0.0522433 -0.0637656 0.0826396 0.0190955 0.1245073 0.0564076 0.0252211 0.0408476 -0.0247553 0.0523157 -0.0638607 0.0824717 -0.0191118 0.1243866 0.0566518 0.0246983 0.0123489 0.0465855 0.0242451 0.0977012 -0.0425229 0.0506488 -0.0844426 -0.1052488 0.3082194 -0.0483776 0.0856105 -0.141512 0.182233 -0.0896187 0.0029812 -0.0421889 0.0356363 0.3076036 0.0253136 -0.0956382 -0.0989254 0.0453944 0.0993094 -0.1010091 0.0515819 0.1728418 0.3075145 -0.0252227 0.0955243 0.0990028 0.0452623 0.0991954 0.1012842 0.0514148 0.1733072 0.3079132 0.048759 -0.0852373 0.1416807 0.1827065 -0.0893681 -0.0024427 -0.0418769 0.0352314 unknown
polarizability: 54.899408|0.0049255|48.9484104|-0.0037323|3.5445867|41.6103449 unknown
InChI: InChI=1S/C3H8N2O/c4-1-3(6)2-5/h1-2,4-5H2
charge 0 multiplicity 1
14 atoms
O  -0.001112 1.070221 0.705016
N  2.558911 -0.116849 0.221618
N  -2.559368 -0.120491 0.221179
C  1.320846 -0.843855 -0.070316
C  -1.320217 -0.845409 -0.071343
C  -0.000243 -0.096866 0.232544
H  1.31007 -1.1393 -1.139759
H  1.312063 -1.79912 0.493909
H  -1.310231 -1.801347 0.491703
H  -1.308782 -1.139526 -1.141154
H  2.660445 0.108908 1.217569
H  2.65727 0.737974 -0.337653
H  -2.658317 0.735355 -0.336422
H  -2.661935 0.103105 1.217509
