program: Gaussian 09
title: 000198418
version: EM64L-G09RevD.01
frameworkgroup: C1[X(C5H9IO3)]
method: RPBEPBE
basis: SDD
operation: Freq
keyword: #pfreq=noraman
keyword: PBEPBE/SDD
title: #p freq=noraman PBEPBE/SDD
converged: YES YES NO NO
title: Mulliken charges:
elementType: I O O O C C C C C H H H H H H H H H
charge: 0.054194 -0.286860 -0.233623 -0.435033 -0.046100 -0.335257 0.064854 -0.360898 -0.755808 0.227748 0.212553 0.247740 0.263498 0.224105 0.221724 0.287186 0.306113 0.343865
chargesum: 0.00000
title: Mulliken charges with hydrogens summed into heavy atoms:
elementType: I O O O C C C C C
charge: 0.054194 -0.286860 -0.233623 -0.091168 0.181648 0.125036 0.328351 0.084931 -0.162509
polarizability: 1.31208567e+02 6.07017254e+00 6.22153300e+01 -3.33903639e+00 -1.81090386e+00 5.84320077e+01
1716.lowfreq: -2.7030 -0.0005 -0.0004 -0.0004 7.9167 17.8835 23.8564 65.8195 98.9564
frequency: 23.4840 65.6990 98.9477 142.0349 179.9718 201.0476 256.8146 290.3847 401.6787 429.6075 442.9412 581.3915 625.8758 695.0603 771.8096 827.9538 859.2194 898.3326 905.0986 954.1574 974.4108 1006.5219 1062.1260 1073.5088 1119.5074 1152.3947 1161.3633 1187.7955 1204.0474 1249.2377 1270.8132 1305.5691 1323.6929 1350.7542 1357.7851 1372.7713 1427.1917 1467.6613 1479.8015 2985.7173 2994.8871 2998.7412 3063.3884 3070.3628 3090.9979 3128.7699 3155.5972 3568.5573
redmass: 7.7214 3.9808 3.1946 5.7957 2.5784 4.3916 7.3925 1.1184 6.0060 2.6951 2.3118 5.3798 4.1535 4.7354 2.8711 3.3538 3.4522 1.9256 2.3728 4.3575 3.0738 2.6924 1.4559 4.4919 2.3866 1.3059 1.4487 1.1655 1.3534 1.2041 1.1462 1.2190 1.2491 1.2275 1.3037 1.4078 1.1102 1.0820 1.0893 1.0800 1.0713 1.0668 1.0685 1.0775 1.1017 1.0984 1.1096 1.0666
irintensity: 0.3937 0.4302 6.7867 1.0512 8.6726 6.3731 8.6872 165.2007 0.9363 23.7291 23.3226 59.0513 10.0453 18.2249 8.5267 22.6180 68.2261 6.2660 11.7666 66.3592 143.9610 22.6812 4.2827 132.2877 23.0701 5.8181 15.4668 25.1290 9.4785 1.3473 7.3414 0.6946 19.2517 15.7137 5.6376 0.8926 16.7946 6.9550 9.8399 30.8985 51.2106 46.5893 3.6637 23.9137 31.3872 18.5686 3.7461 10.3300
temp: 298.150 k
press: 1.00000 atm
elementType: 53 8 8 8 6 6 6 6 6 1 1 1 1 1 1 1 1 1
symmnumber: 1
zpe: 366389.2 jmol-1
zpe.correction: 0.139550 hartree
zpe.thermalcorrener: 0.149516 hartree
zpe.thermalcorrenthalpy: 0.150460 hartree
zpe.thermalcorrgfe: 0.101161 hartree
zpe.sumelectzpe: -432.335525 hartree
zpe.sumelectthermal: -432.325559 hartree
zpe.sumelectthermalent: -432.324615 hartree
zpe.sumelectthermalfe: -432.373915 hartree
dipole: -3.1095 -0.7263 0.7370
dipole: 3.2771
quadrupole: -59.9289 -70.0622 -71.9946
quadrupole: -2.6893 -6.2013 0.4923
quadrupole: 7.3997 -2.7336 -4.6660 -2.6893 -6.2013 0.4923
hfenergy: -432.4750756 hartree
pointgroup: C01 [X(C5H9I1O3)]
dipole: -1.2033895 0.3380263 -0.3161246 debye
dipolederiv: -0.4515278 0.041178 -0.1167777 0.0983646 -0.0909205 0.0255475 -0.07133 -0.0033717 -0.1158375 -1.3649374 0.0416033 -0.1140181 -0.142813 -0.4726176 -0.0163342 -0.1643863 0.0490309 -0.4301543 -0.7653789 -0.126421 0.0298793 -0.227382 -0.6309077 0.0015805 -0.0079577 0.0715344 -0.4179867 -0.8718775 -0.0626199 0.2120253 -0.1048978 -0.5618658 -0.0630608 0.3003315 -0.0930247 -0.2069175 0.6145261 0.0613014 0.0628611 0.4230385 0.1611503 0.0571643 -0.0495082 0.065283 0.2307021 0.4655313 0.1248277 -0.0804504 0.0157797 0.1499081 0.015799 -0.069186 -0.0615133 0.3517594 0.9618051 0.1053362 0.0967652 0.3677634 0.6794753 0.0796263 0.5669896 -0.0274802 0.6354093 0.6591346 0.0993131 -0.0500986 0.1037798 0.4117145 -0.0178281 -0.094361 -0.0031411 0.2132527 0.746436 -0.1800769 0.1037208 -0.3603195 -0.0095562 -0.1005426 -0.0845246 -0.0959887 -0.1454375 -0.1326858 -0.0286873 -0.0967224 -0.0913986 0.0200866 -0.0473466 -0.1014026 -0.0403376 -0.1106317 0.0043766 -0.0088969 -0.0053384 0.0150949 0.0697085 -0.0473924 0.0299708 0.0318615 -0.1760927 0.0405475 -0.0703318 -0.0055957 -0.0836768 -0.0367194 -0.0249633 -0.0246443 -0.0642952 0.0788901 -0.0581226 -0.0336606 0.071325 -0.0266067 0.039569 0.002637 0.0538889 0.0293742 -0.0522602 -0.0356199 0.0583241 -0.0009198 0.0508146 -0.1406209 0.0552034 0.0054071 0.1043915 0.0487258 -0.0023728 -0.0521292 -0.0866477 -0.0313123 0.0694528 0.00167 -0.0791171 -0.043107 -0.0702366 -0.0978997 0.0077364 0.1032244 0.0338683 0.0825711 0.036699 0.0113915 0.0250259 -0.0008746 -0.0493391 0.0621566 -0.0217259 0.0009725 -0.0499535 -0.0073661 -0.0441228 0.0135047 0.0991755 0.3374043 -0.0389531 -0.1015064 -0.0410699 0.3095253 0.048907 -0.1774386 0.0422533 0.0685142 unknown
polarizability: 130.3114881|-5.2917396|62.6668026|9.2497585|-0.8304586|58.8776139 unknown
InChI: InChI=1S/C5H9IO3/c6-1-5-8-3-4(2-7)9-5/h4-5,7H,1-3H2
charge 0 multiplicity 1
18 atoms
I  3.856657 -0.089389 0.847825
O  -0.207822 0.873641 -0.675694
O  0.775725 -1.269888 -0.563948
O  -3.370325 -0.464317 0.873121
C  -1.297583 -0.117838 -0.426936
C  -0.553075 -1.372828 0.084854
C  1.092319 0.150011 -0.589153
C  -2.287903 0.488145 0.577454
C  1.785407 0.66936 0.675957
H  -1.792481 -0.320475 -1.397938
H  -0.46153 -1.364511 1.189289
H  -0.991783 -2.324718 -0.242959
H  1.681993 0.340974 -1.501211
H  -2.678273 1.452285 0.196159
H  -1.78786 0.667517 1.543442
H  1.269077 0.354808 1.595022
H  1.881632 1.764071 0.639155
H  -3.990376 -0.509246 0.102359
