program: Gaussian 09
title: 000198498
version: EM64L-G09RevD.01
frameworkgroup: C1[X(C22H26N2O)]
method: RPBEPBE
basis: SDD
operation: Freq
keyword: #p
keyword: freq=noraman
keyword: PBEPBE/SDD
title: #p freq=noraman PBEPBE/SDD
converged: NO YES NO NO
title: Mulliken charges:
elementType: O N N C C C C C C C C C C C C C C C C C C C C C C H H H H H H H H H H H H H H H H H H H H H H H H H H
charge: -0.283243 -0.110016 -0.265501 -0.112184 -0.072012 -0.471983 -0.405019 -0.411785 -0.387651 0.268760 -0.552792 0.257805 -0.381137 -0.396930 0.366954 0.187062 -0.269656 -0.249272 -0.483090 -0.342812 -0.337913 -0.677527 -0.228260 -0.227163 -0.234491 0.195485 0.261707 0.239722 0.204733 0.192539 0.222016 0.213559 0.183013 0.194768 0.212731 0.207777 0.235206 0.229087 0.232784 0.225367 0.225902 0.240361 0.240573 0.249607 0.254619 0.205739 0.230185 0.227486 0.230871 0.231747 0.232269
chargesum: 0.00000
title: Mulliken charges with hydrogens summed into heavy atoms:
elementType: O N N C C C C C C C C C C C C C C C C C C C C C C
charge: -0.283243 -0.110016 -0.265501 0.083301 0.189695 -0.027527 0.009537 -0.015213 0.019849 0.268760 -0.109809 0.257805 -0.152051 -0.164146 0.366954 0.187062 -0.044289 -0.023370 -0.002156 -0.093205 -0.083294 -0.014117 0.002611 0.004584 -0.002222
polarizability: 2.68868205e+02 -2.76658711e-01 2.32854086e+02 -1.88702594e+01 7.96663937e+00 2.29747838e+02
1716.lowfreq: -17.2065 -7.7278 -6.5740 -0.0002 0.0001 0.0006 5.4609 16.2216 34.3475
frequency: -9.3479 15.0086 34.3078 42.2548 50.0794 69.6562 75.9034 87.6255 93.4994 135.7457 160.5121 186.1906 193.6701 216.7507 225.3994 253.1685 269.3872 288.4471 292.2700 322.7266 359.7252 390.8389 402.3431 411.1042 436.5309 444.5557 461.7362 466.3274 477.0859 485.4271 526.5366 540.0559 568.2092 592.6670 616.2789 618.9980 635.9937 652.7237 704.9382 714.3604 730.4809 738.2721 767.7281 770.0637 784.1927 799.8887 822.6834 838.3977 852.1312 870.1035 873.5252 918.6541 923.0281 930.2998 946.8452 967.4102 978.0668 982.9850 985.2089 990.5746 997.0117 1004.3378 1013.4667 1022.9067 1030.1126 1040.0439 1054.6658 1061.9673 1074.4299 1077.5777 1094.6066 1107.1465 1111.7280 1116.3294 1131.8332 1158.5632 1170.0783 1171.8793 1174.5101 1178.5181 1198.5731 1204.0982 1222.3754 1224.9639 1238.3864 1245.0635 1255.3347 1256.2523 1263.5077 1282.0574 1291.6166 1304.7121 1313.9493 1323.5775 1329.0048 1338.2003 1347.8504 1350.9949 1354.6036 1370.8564 1378.1186 1380.6241 1390.7735 1395.3330 1434.5172 1439.5528 1444.4838 1444.5842 1447.5714 1460.1262 1465.6264 1466.6919 1478.5848 1481.6559 1481.9831 1487.2909 1584.5026 1587.9079 1588.9943 1608.8530 1614.1748 2775.8929 2832.0779 2858.1968 2979.3967 2985.5893 2991.7877 2996.8507 2998.5153 3006.5377 3026.4112 3031.2434 3032.3908 3036.5038 3060.1036 3071.4064 3092.0599 3103.8337 3112.0742 3121.1658 3127.4112 3134.3127 3137.1540 3146.8809 3154.7478 3158.2128 3168.1854
redmass: 4.7027 2.6671 4.1825 4.0497 2.6635 4.3713 3.6228 3.4790 3.8693 3.6437 3.2254 1.7371 1.7865 3.6860 3.7861 3.1297 2.4705 3.6915 3.1507 2.4833 4.9628 5.9920 3.4930 2.8763 3.2061 3.4722 2.9820 3.3850 3.0152 3.6547 2.8490 3.4179 3.4626 3.0376 4.6867 6.0225 4.3799 3.9465 1.7917 4.1646 2.3750 2.2570 2.3505 1.9846 2.2948 1.3795 1.8886 3.4733 1.2399 1.3527 2.1541 2.3970 1.6373 1.9162 1.4263 2.3672 1.3869 1.9532 1.5509 5.2659 1.3144 2.4803 1.9692 1.9681 2.1845 2.1621 2.2583 2.2876 1.5498 1.5936 2.8515 2.2931 3.0620 2.5941 1.6197 1.7984 1.7835 1.0548 1.0803 1.1192 1.7507 1.5228 1.5175 1.9573 3.1840 1.7650 1.4244 1.1708 1.5471 1.2986 1.4509 1.3794 1.4332 1.4028 1.5310 1.4452 1.5488 1.8944 1.4146 7.9883 1.7063 4.7606 1.5624 1.2137 2.1926 2.1933 1.1024 1.1411 1.1121 1.0971 1.0929 1.0394 1.1158 1.4449 1.5541 2.2288 7.6240 6.3233 6.9358 6.3707 6.3747 1.0781 1.0705 1.0710 1.0601 1.0593 1.0610 1.0381 1.0683 1.0718 1.0877 1.0987 1.0887 1.1002 1.1032 1.1032 1.0998 1.1000 1.0867 1.0876 1.0848 1.0882 1.0933 1.0927 1.0968 1.1006 1.1016
irintensity: 0.5365 0.0162 0.5559 0.0700 0.2052 0.0599 4.3783 0.2145 0.5454 0.0471 0.2782 0.2452 1.2024 2.9956 2.9477 0.8023 1.9346 8.7464 0.7881 1.1449 1.1001 11.8086 0.3903 0.0421 3.0451 4.2555 8.9815 2.6220 3.0424 3.8392 3.0845 11.1033 4.9148 6.4662 1.7235 1.1167 7.1007 6.4367 58.7442 8.6090 28.5475 39.6348 13.4404 15.7043 11.7988 12.3375 1.3434 3.0374 0.1232 0.2917 3.1929 3.2589 1.7063 1.6359 0.7098 6.8143 0.1280 2.6595 1.2203 0.7581 0.0294 0.9147 11.2981 3.1067 20.6563 6.4247 18.5590 6.5141 8.6946 2.9138 13.7403 16.1948 9.4791 9.4736 31.2910 5.2214 4.5990 0.0102 1.4388 0.0295 2.5822 8.8224 48.7452 15.0657 151.6005 65.1154 11.4583 0.8133 58.2326 7.0930 24.8106 0.2022 1.2437 17.0207 23.9910 32.5807 24.9047 28.7285 8.3403 0.7528 30.3483 2.3256 4.6014 28.2351 5.6926 5.9414 29.0394 8.3092 1.1741 11.2896 1.9586 11.1510 12.3458 48.9772 22.3335 28.7655 248.6665 5.2830 2.3302 8.6933 2.1501 48.3588 71.6618 153.1368 28.8908 29.1399 22.6772 37.3160 10.8258 32.2939 17.3779 5.3985 75.9194 36.7465 24.8215 24.2180 30.7311 29.3651 12.2056 3.4678 1.9547 2.1059 35.0972 22.3183 24.7924 33.5209 13.1862
temp: 298.150 k
press: 1.00000 atm
elementType: 8 7 7 6 6 6 6 6 6 6 6 6 6 6 6 6 6 6 6 6 6 6 6 6 6 1 1 1 1 1 1 1 1 1 1 1 1 1 1 1 1 1 1 1 1 1 1 1 1 1 1
symmnumber: 1
zpe: 1128665.7 jmol-1
zpe.correction: 0.429886 hartree
zpe.thermalcorrener: 0.451451 hartree
zpe.thermalcorrenthalpy: 0.452395 hartree
zpe.thermalcorrgfe: 0.377966 hartree
zpe.sumelectzpe: -1036.850508 hartree
zpe.sumelectthermal: -1036.828944 hartree
zpe.sumelectthermalent: -1036.828000 hartree
zpe.sumelectthermalfe: -1036.902428 hartree
dipole: -0.3323 3.6094 -0.7190
dipole: 3.6953
quadrupole: -138.3496 -154.1489 -139.2073
quadrupole: -8.8671 4.1511 7.2358
quadrupole: 5.5523 -10.2470 4.6946 -8.8671 4.1511 7.2358
hfenergy: -1037.2803945 hartree
pointgroup: C01 [X(C22H26N2O1)]
dipole: -0.0789898 -1.2402146 -0.7545196 debye
polarizability: 269.8244938|-10.6600382|222.5203247|13.9703254|2.7738016|239.1253107 unknown
InChI: InChI=1S/C22H26N2O/c1-2-22(25)24(18-9-4-3-5-10-18)19-13-15-23-14-12-17-8-6-7-11-20(17)21(23)16-19/h3-11,19,21H,2,12-16H2,1H3
charge 0 multiplicity 1
51 atoms
O  -2.573508 2.602009 1.068269
N  1.819536 0.718364 -1.646942
N  -2.140462 0.543826 0.058055
C  1.720756 0.925339 -0.177224
C  -0.808395 1.031697 -0.417589
C  0.367579 0.337347 0.309114
C  -0.640364 0.909891 -1.947424
C  0.746224 1.442315 -2.363489
C  3.174506 0.981316 -2.177826
C  2.921937 0.338046 0.574516
C  4.1354 -0.087684 -1.632163
C  4.068042 -0.148312 -0.113416
C  2.9166 0.321937 1.993306
C  5.158919 -0.664839 0.630626
C  -2.54864 -0.812276 -0.247148
C  -2.950698 1.418603 0.80216
C  4.006022 -0.19268 2.725894
C  5.134857 -0.698605 2.040093
C  -4.305651 0.869853 1.271774
C  -3.32084 -1.079339 -1.40501
C  -2.179099 -1.881208 0.606944
C  -5.087326 1.894247 2.112908
C  -3.720225 -2.400655 -1.704937
C  -2.576918 -3.202656 0.303925
C  -3.348987 -3.465924 -0.851377
H  1.697962 2.029597 0.047125
H  -0.803239 2.103976 -0.139955
H  0.372874 -0.748879 0.103249
H  0.254164 0.48896 1.397504
H  -1.431895 1.487671 -2.462092
H  -0.72149 -0.147836 -2.259469
H  0.891241 1.293946 -3.44969
H  0.793744 2.546411 -2.168035
H  3.544793 2.002882 -1.906048
H  3.130361 0.927794 -3.281237
H  5.172356 0.123135 -1.957668
H  3.846359 -1.066748 -2.061842
H  2.053901 0.725254 2.536387
H  6.040023 -1.035232 0.091307
H  3.97821 -0.193789 3.821281
H  5.988356 -1.099898 2.598013
H  -4.139923 -0.061745 1.847354
H  -4.896994 0.564388 0.386372
H  -3.602808 -0.248049 -2.060788
H  -1.587897 -1.670148 1.504497
H  -6.058417 1.470901 2.427756
H  -5.271595 2.817281 1.53791
H  -4.518217 2.183032 3.012772
H  -4.317931 -2.597955 -2.601749
H  -2.286182 -4.023316 0.969008
H  -3.658227 -4.490745 -1.084402
