program: Gaussian 09
title: 000198428
version: EM64L-G09RevD.01
frameworkgroup: C1[X(C13H13N3O5)]
method: RPBEPBE
basis: SDD
operation: Freq
keyword: #p
keyword: freq=noraman
keyword: PBEPBE/SDD
title: #p freq=noraman PBEPBE/SDD
converged: NO YES NO NO
title: Mulliken charges:
elementType: O O O O O N N N C C C C C C C C C C C C C H H H H H H H H H H H H H
charge: -0.314410 -0.380810 -0.261281 -0.468972 -0.236667 -0.261549 -0.444247 -0.648232 0.121990 -0.528882 0.234534 -0.424427 0.171535 0.126636 0.039868 0.025274 -0.491870 0.268155 0.221919 0.061321 -0.520801 0.241577 0.242579 0.228012 0.241345 0.283065 0.344352 0.376842 0.337880 0.320669 0.225827 0.244475 0.237503 0.386792
chargesum: 0.00000
title: Mulliken charges with hydrogens summed into heavy atoms:
elementType: O O O O O N N N C C C C C C C C C C C C C
charge: -0.314410 -0.003969 -0.261281 -0.082180 -0.236667 -0.261549 -0.099895 0.010317 0.121990 -0.044726 0.234534 0.044930 0.171535 0.126636 0.039868 0.025274 -0.208805 0.268155 0.221919 0.061321 0.187004
polarizability: 3.19393696e+02 -1.10271068e+01 1.98621491e+02 6.93343423e+00 1.50431825e+00 9.40450918e+01
1716.lowfreq: -3.6657 -0.0008 -0.0006 -0.0004 4.5959 4.9823 38.2945 44.3346 71.6739
frequency: 38.2863 44.3135 71.6724 78.6816 82.7605 86.8602 108.6938 123.5416 149.1486 170.4927 178.0374 188.1068 221.2124 249.5966 256.7600 271.2097 297.2807 313.2553 374.8375 385.0443 411.9109 436.6677 443.4186 486.6856 502.4332 514.9327 526.3344 530.8707 545.1719 560.6866 591.1958 601.1814 612.9833 627.4704 658.1954 659.9678 679.0547 713.0292 715.4317 745.3099 768.8033 785.5098 847.4774 873.0359 920.9199 928.7646 961.4828 981.1072 1006.9227 1017.7726 1048.2526 1069.1195 1079.3218 1098.1184 1111.8452 1133.2520 1147.3793 1164.0563 1186.4918 1206.3295 1228.2654 1259.5314 1275.0434 1304.5226 1314.1210 1347.8964 1354.5875 1369.3219 1383.9673 1421.2535 1439.1985 1456.6925 1462.7377 1473.1911 1479.3974 1491.2673 1495.3155 1540.0615 1588.1844 1612.2027 1647.3830 1650.8303 1667.4008 2972.3894 2981.2059 2982.6922 3057.9731 3068.1145 3082.8096 3123.8805 3228.8167 3463.3744 3535.1871 3550.2973 3609.6973 3689.8414
redmass: 6.4181 3.0237 7.6119 5.0397 6.1107 6.8804 4.8083 2.9501 1.2332 5.1329 3.7774 4.2018 3.9933 5.5910 6.0571 4.9074 4.9555 4.7745 6.7466 7.4985 6.4034 1.8435 1.8731 6.3057 5.0981 4.9838 1.1912 1.4770 1.1776 4.5021 3.4442 3.0565 1.2273 3.6903 4.3299 4.8286 6.1300 5.1686 8.1070 4.7832 6.1495 2.7077 1.5701 3.2018 4.3802 6.8841 3.6037 5.6055 2.9169 2.9252 1.7686 2.0912 3.0143 2.6116 1.2489 2.4330 1.4731 1.9503 1.4001 1.5396 1.3804 1.9041 1.5620 1.8726 2.4591 4.5733 2.4111 5.2579 6.3011 2.5171 1.6951 1.0551 1.2003 1.0572 2.0062 2.1559 2.9118 7.7675 1.5311 5.9157 4.6250 6.3173 8.7764 1.0303 1.0689 1.0646 1.0952 1.1053 1.0999 1.1027 1.0982 1.0640 1.0450 1.0646 1.0808 1.1038
irintensity: 2.4152 3.2032 5.6511 4.4551 7.3313 0.8696 1.4903 1.0357 0.4299 1.8485 2.8908 4.0932 0.0549 2.7948 1.4351 9.8514 3.7183 12.0347 5.5941 6.1654 1.8226 66.0431 71.3512 10.7447 37.8501 19.4571 163.6315 59.1257 103.8373 23.6661 34.2854 67.6325 52.2860 2.0220 5.7943 10.9549 10.5549 52.5782 12.2539 8.9660 21.9388 2.2152 37.8588 12.7836 22.8743 157.7824 14.1409 33.4155 26.3441 193.6894 20.6522 13.8006 202.2333 34.7894 0.7268 179.4706 14.2744 36.0109 16.1711 3.7467 85.3986 41.8820 5.7834 108.6553 40.1345 30.0650 85.9755 732.3380 100.0613 95.4102 26.1196 17.0780 16.5119 14.2497 113.0485 77.2132 24.8151 115.9714 199.5872 10.0824 232.1992 193.9276 583.1761 49.8306 37.4178 52.4281 18.2884 24.9417 21.5119 26.5417 0.2131 72.4362 57.3028 67.2457 108.1538 34.1322
temp: 298.150 k
press: 1.00000 atm
elementType: 8 8 8 8 8 7 7 7 6 6 6 6 6 6 6 6 6 6 6 6 6 1 1 1 1 1 1 1 1 1 1 1 1 1
symmnumber: 1
zpe: 665107.8 jmol-1
zpe.correction: 0.253326 hartree
zpe.thermalcorrener: 0.272782 hartree
zpe.thermalcorrenthalpy: 0.273726 hartree
zpe.thermalcorrgfe: 0.205365 hartree
zpe.sumelectzpe: -1042.058157 hartree
zpe.sumelectthermal: -1042.038701 hartree
zpe.sumelectthermalent: -1042.037757 hartree
zpe.sumelectthermalfe: -1042.106118 hartree
dipole: -1.2424 0.0858 -1.0157
dipole: 1.6071
quadrupole: -109.3562 -106.5618 -125.2023
quadrupole: 30.1402 7.7445 4.2112
quadrupole: 4.3506 7.1450 -11.4955 30.1402 7.7445 4.2112
hfenergy: -1042.3114831 hartree
pointgroup: C01 [X(C13H13N3O5)]
dipole: -0.5045953 -0.0325418 0.3796039 debye
polarizability: 319.7161249|10.2124136|198.4716535|2.1504174|2.4387319|93.8725007 unknown
InChI: InChI=1S/C13H13N3O5/c1-21-11-8-6(4-7(15-8)12(18)19)5-2-3-16(13(14)20)9(5)10(11)17/h4,15,17-18H,2-3,14H2,1H3
charge 0 multiplicity 1
34 atoms
O  0.472126 -2.887077 0.485774
O  -2.157973 -2.047635 0.61878
O  -3.77768 -0.730286 -1.411748
O  5.261446 -0.37367 0.122155
O  5.180624 1.953996 -0.125136
N  -2.810333 0.838779 0.074668
N  2.569608 -0.636249 0.13718
N  -5.110742 0.90511 -0.40992
C  -0.513748 1.24587 -0.022888
C  -1.17134 2.61152 -0.160154
C  -1.507079 0.25743 0.097285
C  -2.650351 2.321712 0.253428
C  0.85542 0.880905 0.000967
C  1.186547 -0.522192 0.136855
C  -1.17406 -1.113271 0.316566
C  0.185567 -1.506099 0.273897
C  2.09998 1.596332 -0.080343
C  3.132993 0.648916 0.007787
C  -3.891829 0.259682 -0.636838
C  4.571889 0.86185 -0.014047
C  0.711466 -3.633755 -0.780511
H  -0.713126 3.375878 0.49079
H  -1.103282 2.977725 -1.203901
H  -2.810141 2.594173 1.314911
H  -3.382677 2.859124 -0.370783
H  2.252225 2.668003 -0.191535
H  3.117744 -1.481311 0.287697
H  -1.698878 -2.908019 0.8271
H  -5.914662 0.545479 -0.919555
H  -5.266736 1.502749 0.399291
H  1.603298 -3.239361 -1.302003
H  -0.16633 -3.559061 -1.448954
H  0.880996 -4.679395 -0.481852
H  6.238436 -0.195251 0.112537
