program: Gaussian 09
title: 000198438
version: EM64L-G09RevD.01
frameworkgroup: C1[X(C22H18)]
method: RPBEPBE
basis: SDD
operation: Freq
keyword: #p
keyword: freq=noraman
keyword: PBEPBE/SDD
title: #p freq=noraman PBEPBE/SDD
converged: YES YES NO NO
title: Mulliken charges:
elementType: C C C C C C C C C C C C C C C C C C C C C C H H H H H H H H H H H H H H H H H H
charge: -0.199040 0.087892 -0.577552 -0.241895 0.159693 0.348021 0.667234 0.301119 -0.735502 0.318539 -0.765616 -0.499335 0.107870 -0.438515 -0.482821 0.425857 -0.819553 -0.505371 -0.337723 -0.443937 -0.264215 -0.253866 0.230282 0.236734 0.227408 0.232187 0.230467 0.218113 0.233036 0.240912 0.222711 0.243146 0.229152 0.228839 0.228598 0.231910 0.220693 0.240096 0.226222 0.228209
chargesum: 0.00000
title: Mulliken charges with hydrogens summed into heavy atoms:
elementType: C C C C C C C C C C C C C C C C C C C C C C
charge: 0.031243 0.087892 -0.113411 -0.241895 0.159693 0.348021 0.667234 0.301119 -0.054734 0.318539 -0.532579 -0.258423 0.107870 -0.215804 -0.239676 0.425857 -0.132964 -0.273461 -0.117030 -0.203841 -0.037994 -0.025656
polarizability: 4.42763736e+02 8.45225638e+00 2.57621397e+02 1.70933620e+00 -1.00322001e+01 1.08453890e+02
1716.lowfreq: -14.5601 -2.1538 -0.0006 -0.0003 0.0003 4.2925 15.8832 50.0230 60.3103
frequency: 5.7106 50.0108 60.2956 67.1491 111.8637 142.2482 163.0726 182.2335 221.5375 235.5723 245.6639 249.5230 276.0743 315.8048 342.4376 363.7183 380.6302 424.9992 446.8454 471.3406 483.5348 514.1950 525.9182 530.5266 559.7593 563.2369 581.1720 602.6276 613.1917 634.4907 648.3348 708.1338 740.2497 758.1480 765.6508 786.0417 799.1978 803.4714 818.5122 826.1105 848.3763 865.5239 885.6538 887.7152 908.5759 920.3139 954.6228 959.8969 965.2309 974.9033 979.5636 990.0051 1030.3987 1033.6146 1041.6536 1047.8935 1067.7452 1086.1814 1095.4322 1129.0681 1158.1401 1178.1677 1180.5253 1186.6862 1210.7969 1230.1320 1232.2549 1239.4741 1248.3683 1273.0243 1281.6026 1290.5456 1323.4434 1342.2102 1370.1780 1385.8429 1391.2723 1398.3791 1403.9731 1408.2032 1435.4728 1454.2067 1460.0684 1464.6221 1469.4384 1472.2024 1473.2997 1479.0742 1486.6980 1508.6362 1552.8348 1581.0782 1606.9586 1620.0446 1624.3792 1632.4569 2968.7388 2973.8523 2977.6801 2991.0834 3027.5465 3042.4460 3074.6183 3080.9585 3081.5333 3112.9875 3119.2761 3121.2056 3131.7439 3139.2669 3142.4454 3148.6357 3152.4345 3165.6392
redmass: 1.0438 4.0684 3.8665 2.8238 3.5909 4.4311 3.3738 3.4511 1.3220 3.9516 2.3085 2.7189 4.0813 4.5137 4.5118 3.5991 2.5115 3.0580 4.9857 3.6699 5.3852 4.4190 4.2264 3.5975 3.4085 4.6429 3.4269 3.9219 6.0473 5.7061 3.7749 3.0469 5.5622 1.3362 4.7262 2.1247 5.5084 1.7604 1.7652 3.0630 1.9158 4.0548 1.7583 2.0613 2.1085 2.2713 1.3809 1.8488 1.4052 2.5803 1.4289 1.3653 3.7341 1.5008 2.2200 2.1095 2.1017 1.7242 2.0838 1.9701 1.3857 1.0899 1.5205 1.4110 1.7724 1.5457 1.8524 1.7683 2.0008 1.9054 1.4366 1.5688 3.1474 3.8873 3.1062 1.2719 2.3090 1.3980 4.3833 2.6491 2.9152 1.4295 2.5294 1.5247 1.0464 1.0546 2.7652 1.0731 2.1989 3.7648 5.8894 8.5087 6.3713 6.8693 7.1635 8.1795 1.0379 1.0651 1.0359 1.0796 1.1006 1.0973 1.1004 1.0982 1.0996 1.0864 1.0867 1.0860 1.0885 1.0963 1.0921 1.0972 1.0924 1.0987
irintensity: 0.4974 0.6428 0.1141 0.2953 0.0134 0.3194 0.3893 1.2693 1.0097 4.4089 1.4970 1.1554 0.1201 1.6752 0.4541 0.1544 0.5817 4.4751 3.2678 1.6752 0.7457 0.2487 1.7647 1.8942 9.8238 1.6966 0.2183 1.8531 0.1414 4.5926 2.1775 5.1132 0.1238 51.5351 5.4390 0.0744 1.5002 13.5397 6.2951 15.4470 61.6901 2.5715 1.2410 0.7238 1.2359 26.0986 3.6462 11.7715 3.7556 1.8307 1.5633 0.4825 1.0284 5.3149 2.9687 7.7892 4.7818 7.3835 0.5400 5.8649 1.1171 0.8902 4.7338 1.4040 0.1441 11.0127 1.8366 3.3994 6.8279 2.8568 2.9821 3.5212 0.4691 7.0260 3.9431 13.8964 3.7449 6.6026 3.0896 2.3946 9.3212 1.6015 1.4451 7.3624 15.4127 14.1017 1.6975 3.2331 7.8082 30.0261 4.4006 13.3569 5.1029 0.8635 4.1346 4.6659 60.5135 13.6037 38.8504 37.8396 25.7159 16.9935 42.4737 30.6549 16.4846 10.0343 0.5031 5.9638 8.3876 38.7171 7.0692 26.9382 34.2054 41.2020
temp: 298.150 k
press: 1.00000 atm
elementType: 6 6 6 6 6 6 6 6 6 6 6 6 6 6 6 6 6 6 6 6 6 6 1 1 1 1 1 1 1 1 1 1 1 1 1 1 1 1 1 1
symmnumber: 1
zpe: 856516.6 jmol-1
zpe.correction: 0.326230 hartree
zpe.thermalcorrener: 0.343627 hartree
zpe.thermalcorrenthalpy: 0.344571 hartree
zpe.thermalcorrgfe: 0.279459 hartree
zpe.sumelectzpe: -847.697448 hartree
zpe.sumelectthermal: -847.680051 hartree
zpe.sumelectthermalent: -847.679107 hartree
zpe.sumelectthermalfe: -847.744219 hartree
dipole: -1.2541 0.8276 -0.1108
dipole: 1.5067
quadrupole: -109.9303 -113.5992 -135.6712
quadrupole: -1.9634 0.6759 -2.5472
quadrupole: 9.8033 6.1344 -15.9377 -1.9634 0.6759 -2.5472
hfenergy: -848.0236783 hartree
pointgroup: C01 [X(C22H18)]
dipole: -0.489491 -0.3318149 0.040817 debye
polarizability: 442.9351237|-6.2481275|257.6249415|-1.920427|-8.6269939|108.278958 unknown
InChI: InChI=1S/C22H18/c1-13-7-8-16-12-20-17-6-4-3-5-15(17)9-10-18(20)21-14(2)11-19(13)22(16)21/h3-10,12,14H,11H2,1-2H3
charge 0 multiplicity 1
40 atoms
C  -1.884152 -2.271641 0.169088
C  -0.961063 -1.046449 0.132213
C  -3.331099 -1.651352 0.334537
C  -1.749094 0.122737 0.060374
C  -3.147628 -0.148596 0.1419
C  0.448684 -0.939392 0.125386
C  -1.197006 1.437717 -0.064877
C  1.051006 0.393774 0.000628
C  -1.781899 -3.12014 -1.128916
C  -4.063829 0.905581 0.0757
C  0.221505 1.53919 -0.098729
C  -2.150136 2.512535 -0.135257
C  2.523103 0.498815 -0.015046
C  -3.52221 2.239599 -0.070754
C  1.30624 -2.101021 0.252706
C  3.323558 -0.694382 0.109155
C  -5.562969 0.683003 0.161767
C  2.67942 -1.985458 0.249691
C  3.208558 1.74403 -0.148704
C  4.748004 -0.601544 0.098759
C  4.610351 1.817344 -0.15838
C  5.391854 0.636001 -0.032828
H  -1.647087 -2.924852 1.032016
H  -3.740942 -1.869124 1.340919
H  -4.038155 -2.089786 -0.395791
H  -2.058819 -2.510151 -2.008272
H  -0.756436 -3.496194 -1.292471
H  -2.464175 -3.988942 -1.081161
H  0.666979 2.534275 -0.195622
H  -1.802006 3.547225 -0.235925
H  -4.232173 3.074665 -0.126155
H  0.838558 -3.084402 0.370371
H  -5.921852 0.021635 -0.650165
H  -6.11786 1.634103 0.089848
H  -5.846094 0.200351 1.117159
H  3.314352 -2.873118 0.356389
H  2.639952 2.673183 -0.249093
H  5.335555 -1.522435 0.195818
H  5.103319 2.790095 -0.26399
H  6.485588 0.695523 -0.039791
