program: Gaussian 09
title: 000198446
version: EM64L-G09RevD.01
frameworkgroup: C1[X(C9H19O4PS3)]
method: RPBEPBE
basis: SDD
operation: Freq
keyword: #p
keyword: freq=noraman
keyword: PBEPBE/SDD
title: #p freq=noraman PBEPBE/SDD
converged: YES YES NO NO
title: Mulliken charges:
elementType: S S S P O O O O C C C C C C C C C H H H H H H H H H H H H H H H H H H H
charge: 0.062467 0.180709 -0.245952 0.580523 -0.463847 -0.468109 -0.254757 -0.249125 -0.623752 -0.621494 -0.238893 -0.262701 -0.768304 -0.667069 -0.643615 0.354579 -0.501565 0.285710 0.296900 0.340872 0.269501 0.234180 0.226551 0.230193 0.238387 0.297172 0.281484 0.207025 0.289439 0.223184 0.246284 0.219714 0.220836 0.236333 0.240937 0.246202
chargesum: 0.00000
title: Mulliken charges with hydrogens summed into heavy atoms:
elementType: S S S P O O O O C C C C C C C C C
charge: 0.062467 0.180709 -0.245952 0.580523 -0.463847 -0.468109 -0.254757 -0.249125 -0.041142 -0.011121 0.221838 0.205879 -0.189648 0.052579 0.043219 0.354579 0.221908
polarizability: 2.40910213e+02 -1.41625338e+01 1.95110555e+02 5.34096076e+00 6.84583701e+00 1.55825756e+02
1716.lowfreq: -11.4369 -7.4273 -0.0025 0.0020 0.0027 1.4053 12.8338 22.7711 27.9320
frequency: 12.3304 21.6437 27.8334 31.6290 36.8493 43.0262 52.1184 75.6910 82.8481 86.2908 98.3838 118.2625 120.0624 134.7094 161.8743 176.7258 191.3184 206.0339 215.3567 220.5148 233.7184 245.6251 251.9148 272.6582 293.5676 326.3824 347.7488 386.6867 394.8584 423.7508 439.4948 530.7063 555.8229 618.2365 623.1487 647.1885 663.4284 671.6543 732.9563 740.4971 781.2408 794.0931 805.8676 841.3300 850.7804 893.8214 958.1780 978.6889 1004.3967 1013.7533 1047.3955 1088.9484 1096.0530 1109.7347 1112.6443 1138.3664 1140.3477 1142.6157 1150.2805 1219.4359 1239.7742 1247.7116 1269.7364 1270.4428 1282.8632 1284.2258 1346.2242 1351.9558 1393.3441 1398.1800 1420.7398 1426.7204 1432.2633 1453.2755 1456.0910 1458.2527 1459.4542 1463.1229 1464.1514 1464.3080 1476.8068 1491.6337 1631.6675 2984.9528 2987.1221 3000.3281 3001.1617 3005.7109 3035.7334 3043.7304 3056.6392 3074.5332 3074.8558 3082.2547 3089.9676 3103.8387 3106.8038 3108.1861 3113.1434 3129.7270 3143.8104 3152.1812
redmass: 5.0433 4.3803 4.2054 5.0874 5.1110 3.9751 3.1815 3.6303 4.0231 4.1919 1.2128 3.2205 5.2430 4.2867 2.3471 3.5195 4.4663 2.7649 5.3383 4.9872 1.2924 1.5874 3.4298 3.6626 4.7924 6.9599 3.7646 5.2116 2.5295 3.6554 4.5433 10.9916 7.1548 8.4813 8.0535 5.4736 9.2242 4.7293 6.6781 1.2348 4.0301 1.1208 1.1348 4.0790 3.5643 1.8109 1.8542 4.5723 2.6234 2.9615 4.7730 2.1698 2.1961 1.4959 1.2717 1.3932 1.2747 1.4886 1.4340 1.1474 1.3304 1.7259 1.1217 1.1121 1.1730 1.1341 1.2093 1.2056 1.2267 1.2166 1.1471 1.1348 1.0971 1.0500 1.0823 1.0697 1.0683 1.0508 1.0460 1.0472 1.0554 1.0535 9.1050 1.0368 1.0360 1.0621 1.0633 1.0296 1.0600 1.0576 1.0576 1.0994 1.1020 1.0975 1.0991 1.1033 1.1054 1.1046 1.1030 1.1078 1.1089 1.1048
irintensity: 0.0854 0.9723 1.4775 0.1798 0.8398 0.5728 1.7744 0.4871 1.5259 0.8885 0.6485 0.6336 0.8182 3.0333 2.3008 3.4898 5.9501 4.4730 3.3814 10.2030 0.4144 0.8443 13.9538 12.0934 6.4471 1.3316 2.8291 13.8514 4.8056 4.0607 14.4979 100.3990 5.5728 105.2156 30.3159 13.1205 114.9460 13.1643 4.2664 9.3874 19.6488 2.4381 3.8021 154.8418 49.0474 5.1172 2.7008 46.7980 133.0765 77.6563 0.1922 7.3214 12.0682 147.1227 2.1599 12.1125 41.1403 1.7126 6.2050 5.2559 61.5451 145.1101 0.0526 0.7511 9.5289 3.3094 12.9916 7.3358 31.6735 28.4590 8.5651 16.3024 27.3319 14.9352 9.6446 4.5330 7.8377 16.5610 7.1142 12.1274 10.8297 10.0325 174.5006 19.9091 14.8984 27.7195 36.8680 33.7586 3.9488 9.7264 5.1581 22.3502 0.4484 32.7505 18.1179 24.5906 0.1859 24.2884 8.6865 4.9755 0.3307 17.0227
temp: 298.150 k
press: 1.00000 atm
elementType: 16 16 16 15 8 8 8 8 6 6 6 6 6 6 6 6 6 1 1 1 1 1 1 1 1 1 1 1 1 1 1 1 1 1 1 1
symmnumber: 1
zpe: 730673.9 jmol-1
zpe.correction: 0.278299 hartree
zpe.thermalcorrener: 0.302360 hartree
zpe.thermalcorrenthalpy: 0.303305 hartree
zpe.thermalcorrgfe: 0.219376 hartree
zpe.sumelectzpe: -2189.272653 hartree
zpe.sumelectthermal: -2189.248592 hartree
zpe.sumelectthermalent: -2189.247647 hartree
zpe.sumelectthermalfe: -2189.331576 hartree
dipole: 2.9764 0.7063 2.8352
dipole: 4.1709
quadrupole: -137.0755 -128.1880 -126.0518
quadrupole: 8.6789 -5.4663 -2.0829
quadrupole: -6.6371 2.2504 4.3866 8.6789 -5.4663 -2.0829
hfenergy: -2189.550952 hartree
pointgroup: C01 [X(C9H19O4P1S3)]
dipole: 1.0624061 -0.4975924 1.1473419 debye
polarizability: 242.5603011|-13.5120689|169.49656|1.0948847|18.479814|179.7896622 unknown
InChI: InChI=1S/C5H9O2S2.C4H10O2PS/c1-7-5(6)4-9-3-2-8;1-3-5-7(8)6-4-2/h2-4H2,1H3;3-4H2,1-2H3
charge 0 multiplicity 1
36 atoms
S  -1.949742 -0.634827 -2.661283
S  2.522771 -1.141724 -1.727599
S  -4.386775 0.741291 -0.198925
P  -2.41606 0.27698 -0.623795
O  -1.254573 1.56055 -0.643578
O  -1.625013 -0.808181 0.5139
O  4.271092 -0.085165 1.049137
O  2.351367 1.230048 0.919232
C  -0.22931 -1.373883 -2.262664
C  0.881167 -0.322154 -2.230413
C  -1.397701 2.699244 0.324137
C  -2.471042 -1.743994 1.314909
C  2.306699 -1.123956 0.168622
C  -0.836915 2.358317 1.704622
C  -2.885904 -2.984428 0.519088
C  2.926619 0.12912 0.745593
C  5.017001 1.099654 1.539265
H  -0.07458 -2.119293 -3.061633
H  -0.330645 -1.895102 -1.297955
H  0.666363 0.489216 -1.516864
H  1.064657 0.118021 -3.223986
H  -0.815736 3.496071 -0.166981
H  -2.464788 2.992838 0.360867
H  -1.813566 -2.001241 2.162246
H  -3.355214 -1.193392 1.689907
H  1.229093 -1.150529 0.39168
H  2.810683 -2.02701 0.540843
H  -0.861869 3.264509 2.340009
H  0.206949 2.013829 1.620256
H  -1.435877 1.574945 2.201231
H  -3.5694 -2.72348 -0.307524
H  -2.005458 -3.503547 0.10145
H  -3.414198 -3.690101 1.18747
H  6.043874 0.740176 1.691956
H  4.577336 1.464184 2.482896
H  4.983696 1.905714 0.787385
