program: Gaussian 09
title: 000198427
version: EM64L-G09RevD.01
frameworkgroup: C1[X(C9H17N3O3S2)]
method: RPBEPBE
basis: SDD
operation: Freq
keyword: #p
keyword: freq=noraman
keyword: PBEPBE/SDD
title: #p freq=noraman PBEPBE/SDD
converged: NO YES NO NO
title: Mulliken charges:
elementType: S S O O O N N N C C C C C C C C C H H H H H H H H H H H H H H H H H
charge: 0.467063 0.207934 -0.247786 -0.309504 -0.239669 -0.441284 -0.503635 0.074171 -0.310157 -0.314173 -0.294410 -0.295129 -0.562029 0.374120 -0.142613 -0.684000 -0.822160 0.226194 0.217467 0.226156 0.237149 0.222779 0.199388 0.198236 0.223394 0.221143 0.259714 0.235786 0.270827 0.243207 0.241493 0.286825 0.291630 0.241872
chargesum: 0.00000
title: Mulliken charges with hydrogens summed into heavy atoms:
elementType: S S O O O N N N C C C C C C C C C
charge: 0.467063 0.207934 -0.247786 -0.309504 -0.239669 -0.441284 -0.503635 0.074171 0.133504 0.149133 0.127757 0.126502 0.154614 0.374120 -0.142613 0.071527 -0.001833
polarizability: 2.28043652e+02 6.03064092e+00 1.70248210e+02 1.16799917e+01 -1.39584896e+01 1.27509663e+02
1716.lowfreq: -8.3008 -7.2579 -0.0022 -0.0022 0.0010 8.2407 18.4678 24.5028 46.0272
frequency: 18.1251 24.4027 45.9990 49.3022 63.3652 68.6546 75.0781 90.8769 96.8850 100.5449 124.4664 130.3357 150.8201 216.4268 223.4828 240.8792 256.1287 270.2105 276.7681 304.6862 333.7078 363.7842 369.6673 382.5786 402.2525 430.2953 458.3765 473.3392 538.7388 556.2814 629.1961 643.7531 659.5766 685.8132 761.6031 795.8581 827.2508 836.8735 891.2410 896.2774 905.8458 965.9652 979.9871 1006.2501 1011.0777 1031.7049 1033.4582 1038.2042 1053.0292 1073.2887 1107.1513 1109.0899 1146.9873 1150.3814 1157.9421 1187.8602 1243.3278 1264.2235 1271.8226 1281.3742 1323.3846 1340.1233 1348.0371 1353.6825 1366.4770 1385.8613 1420.9251 1434.4525 1444.3410 1445.7255 1451.0864 1451.8753 1453.1005 1456.4170 1460.6586 1463.3341 1480.2686 1550.4977 1650.8351 2934.1777 2949.3360 2960.5211 2963.7694 2982.9655 2992.5086 3026.3270 3062.2459 3073.2440 3079.2855 3081.9662 3084.2063 3087.0013 3116.2826 3117.5477 3153.7198 3155.9947
redmass: 4.3840 4.2224 3.5642 5.8890 2.8871 1.4771 2.4075 1.8300 2.2894 3.1717 4.1189 1.1198 3.5958 2.9135 4.0994 2.9640 3.7733 6.9252 4.6292 4.0753 4.1608 4.8697 4.3251 3.1230 5.0582 6.5874 2.8559 3.8052 8.6791 4.0774 3.1161 3.6767 6.8626 11.8968 4.0970 4.0358 12.1754 1.5893 2.3695 4.0478 4.1853 1.9032 1.1900 1.5044 2.3519 1.6729 2.3419 3.6347 2.0341 4.2678 1.3090 2.1991 4.3110 2.4478 2.1281 1.0619 1.3654 7.0110 1.2672 1.2891 1.2493 1.2262 1.1312 1.2948 1.2472 1.2091 1.1550 1.0512 1.0781 1.0811 1.0599 1.0827 1.0852 1.0865 1.0635 1.0569 1.0505 6.8059 10.7513 1.0679 1.0692 1.0655 1.0651 1.0360 1.0373 1.0280 1.0941 1.0987 1.0937 1.0952 1.0972 1.0989 1.1012 1.1013 1.1049 1.1055
irintensity: 0.0691 0.1658 0.2271 0.6211 1.6210 0.5275 1.3927 4.9452 2.8477 0.4548 2.5601 0.1936 3.7577 3.2994 9.5117 3.0089 8.5024 7.3623 18.2951 4.0736 6.7987 0.1838 22.2961 5.2594 45.6253 26.6173 0.5570 0.8719 3.4639 0.8485 21.4385 5.2536 5.6468 17.3479 30.0575 8.3917 153.6696 0.5755 5.0827 94.4395 140.1168 25.4975 6.4202 14.2797 10.9110 39.0455 73.9085 162.9777 35.4572 44.5920 16.7979 11.4302 5.6803 43.5805 100.8590 0.0246 39.7154 491.2735 10.1147 7.3603 3.4896 6.5149 2.1634 6.9075 3.0587 27.9922 34.9947 15.1468 10.7951 1.5513 18.9199 20.4023 46.4947 4.0837 4.5152 32.1654 16.2638 33.3358 276.2189 39.1185 25.8571 23.5880 115.5494 49.8270 7.6333 15.9625 25.6778 26.3664 22.1350 14.3845 27.0227 26.7085 5.0772 8.2028 9.3439 7.7011
temp: 298.150 k
press: 1.00000 atm
elementType: 16 16 8 8 8 7 7 7 6 6 6 6 6 6 6 6 6 1 1 1 1 1 1 1 1 1 1 1 1 1 1 1 1 1
symmnumber: 1
zpe: 693146.6 jmol-1
zpe.correction: 0.264006 hartree
zpe.thermalcorrener: 0.284775 hartree
zpe.thermalcorrenthalpy: 0.285719 hartree
zpe.thermalcorrgfe: 0.211257 hartree
zpe.sumelectzpe: -1537.754641 hartree
zpe.sumelectthermal: -1537.733872 hartree
zpe.sumelectthermalent: -1537.732928 hartree
zpe.sumelectthermalfe: -1537.807390 hartree
dipole: 1.7833 -1.1857 1.4409
dipole: 2.5812
quadrupole: -105.8796 -116.7992 -119.6974
quadrupole: 11.2255 4.2062 -1.5019
quadrupole: 8.2458 -2.6738 -5.5720 11.2255 4.2062 -1.5019
hfenergy: -1538.0186471 hartree
pointgroup: C01[X(C9H17N3O3S2)]
dipole: 0.7038674 0.3860256 -0.621948 debye
polarizability: 226.2641345|-10.5504349|168.9188082|-15.1867398|-15.940532|130.6185831 unknown
InChI: InChI=1S/C9H17N3O3S2/c1-8(16-3)10-15-9(13)11(2)17-12-4-6-14-7-5-12/h4-7H2,1-3H3
charge 0 multiplicity 1
34 atoms
S  1.332966 -0.994526 -1.439736
S  -4.714476 1.588428 0.00643
O  3.888449 2.039206 0.957051
O  -1.241629 -0.404525 -0.223719
O  -1.387908 -2.262468 1.265809
N  2.352864 0.214784 -0.651037
N  0.467012 -1.95565 -0.125417
N  -2.608654 -0.052067 0.270186
C  3.5623 -0.259389 0.072009
C  1.682169 1.347592 0.039559
C  4.531558 0.928414 0.240254
C  2.700367 2.491783 0.214197
C  1.115416 -3.160717 0.439658
C  -0.778978 -1.607908 0.393655
C  -3.060203 0.961148 -0.435025
C  -2.384856 1.699535 -1.565156
C  -5.170842 0.456901 1.442589
H  4.040075 -1.060846 -0.518331
H  3.295604 -0.661955 1.075005
H  1.298999 1.033702 1.034998
H  0.825804 1.677212 -0.572213
H  5.401171 0.640398 0.853619
H  4.874653 1.270751 -0.759637
H  3.004307 2.875667 -0.783234
H  2.269305 3.310615 0.813248
H  1.956709 -3.440144 -0.213428
H  0.391254 -3.991765 0.487495
H  1.489732 -2.974646 1.463954
H  -1.714889 1.017942 -2.113946
H  -1.77243 2.529533 -1.164833
H  -3.128693 2.128299 -2.256996
H  -4.438438 0.574635 2.253325
H  -5.176978 -0.587297 1.100726
H  -6.173942 0.778558 1.761646
