program: Gaussian 09
title: 000198411
version: EM64L-G09RevD.01
frameworkgroup: C1[X(C14H22O)]
method: RPBEPBE
basis: SDD
operation: Freq
keyword: #pfreq=noraman
keyword: PBEPBE/SDD
title: #p freq=noraman PBEPBE/SDD
converged: YES YES YES YES
title: Mulliken charges:
elementType: O C C C C C C C C C C C C C C H H H H H H H H H H H H H H H H H H H H H H
charge: -0.439326 0.249316 0.244669 -0.293139 -0.203702 -0.053785 0.358681 0.356216 -0.734804 -0.694593 -0.694594 -0.724142 -0.724142 -0.867803 -0.864275 0.249412 0.220508 0.231708 0.237877 0.218774 0.201487 0.201478 0.218777 0.237881 0.253432 0.203135 0.211658 0.211657 0.203134 0.253435 0.228384 0.228385 0.238778 0.232164 0.232164 0.232624 0.338573
chargesum: 0.00000
title: Mulliken charges with hydrogens summed into heavy atoms:
elementType: O C C C C C C C C C C C C C C
charge: -0.100753 0.249316 0.244669 -0.043727 0.016806 -0.053785 0.358681 0.356216 -0.503096 -0.036455 -0.036458 -0.055918 -0.055917 -0.172256 -0.167324
polarizability: 1.90838015e+02 -6.52804299e-01 1.69247174e+02 -7.03941380e-03 -1.55657373e-03 1.10819911e+02
1716.lowfreq: -0.0009 -0.0008 -0.0007 6.6206 11.0246 19.2345 58.9351 74.4401 76.8989
frequency: 58.7855 74.2578 76.7290 92.5486 163.0628 165.3792 190.3225 193.9896 196.9889 203.9817 210.9024 222.6840 238.5706 241.0983 250.4833 262.4674 270.2835 319.1260 355.8835 360.9033 418.0299 419.8656 434.1830 436.0591 463.8434 543.7441 556.7402 595.2913 599.5043 626.6488 656.8795 789.2294 798.6453 867.8642 878.8712 890.6612 917.0708 917.2007 938.3019 955.4268 959.8822 1014.0855 1018.9369 1036.7479 1039.7198 1045.1917 1078.4800 1104.9775 1115.3323 1118.1972 1138.4473 1167.7011 1210.5755 1238.1416 1247.1851 1312.3990 1312.7353 1317.4219 1327.5601 1344.2862 1365.0163 1381.7188 1387.2724 1391.9387 1399.3861 1403.7262 1405.5691 1409.4839 1460.4663 1465.9294 1470.2770 1474.4605 1476.9355 1478.3164 1478.3865 1482.0851 1483.0313 1485.8192 1491.4971 1495.7733 1501.5375 1570.9736 1623.3241 2969.0965 2973.5271 2974.1170 2974.8069 2976.9525 2977.3631 3011.9496 3024.8419 3042.7747 3049.7190 3056.7650 3061.0423 3065.3242 3069.3754 3078.7798 3079.3083 3079.5863 3082.5097 3099.9069 3105.5112 3117.8697 3610.6105
redmass: 2.7215 3.5892 2.6362 2.3081 2.6354 1.2115 1.5576 1.1278 2.2942 1.0544 1.5287 1.2422 1.1716 2.6709 2.8369 2.6558 2.4066 2.6536 1.1357 4.1797 4.4221 2.6794 3.6034 3.1266 3.1864 2.7998 5.9263 3.5093 3.0741 3.9182 5.0325 2.6154 5.3397 1.3046 2.5337 2.5785 1.2603 1.1708 2.6095 1.4738 1.3106 2.5523 1.6483 1.7185 1.5170 1.5842 1.8918 1.6195 2.8835 2.7546 2.2265 1.9130 2.0691 1.8456 1.6575 5.1519 1.2759 1.2540 2.0225 1.6505 1.1911 1.2724 1.9176 1.1723 1.5369 1.3904 1.6715 1.2928 1.0437 1.0500 1.3103 1.0561 1.0472 1.0518 1.0888 1.0477 1.0501 1.1451 1.0851 1.4767 1.3308 6.2474 6.5823 1.0381 1.0376 1.0362 1.0361 1.0370 1.0367 1.0816 1.0844 1.0976 1.0975 1.0981 1.0998 1.0989 1.0959 1.0981 1.1000 1.0972 1.0993 1.0990 1.0981 1.0909 1.0648
irintensity: 0.3381 0.6624 0.0005 0.0566 0.5119 9.6631 0.2142 0.7684 6.2953 0.0081 5.5172 0.0828 0.3416 8.3873 0.0897 0.4729 0.0407 1.0279 110.2076 3.8240 0.0868 0.4183 0.9647 0.5215 0.4914 0.7239 6.4203 3.0357 2.6999 0.3088 0.0003 12.5206 0.0004 12.5798 3.2864 2.8231 1.7404 3.2464 16.7955 0.0004 0.2616 0.1105 4.4880 15.6497 0.0114 11.0754 78.7868 43.5831 8.7385 1.7535 8.7605 7.2772 94.7415 0.7508 3.7243 12.0483 1.4074 1.0110 4.2356 4.8581 19.1627 16.4821 12.8899 17.3971 1.3645 10.7968 0.8995 15.0208 2.6964 1.6304 4.4175 9.9811 3.1825 20.1683 44.1625 1.9852 8.3237 27.7353 18.9456 0.5219 11.0792 13.1954 21.2396 48.1663 36.1982 17.2463 53.5743 33.7556 50.5519 26.3798 0.7242 20.6263 19.4616 2.8731 21.1782 80.3111 97.8017 22.2988 16.0556 41.7254 32.7462 1.2249 35.6089 26.3976 43.1338
temp: 298.150 k
press: 1.00000 atm
elementType: 8 6 6 6 6 6 6 6 6 6 6 6 6 6 6 1 1 1 1 1 1 1 1 1 1 1 1 1 1 1 1 1 1 1 1 1 1
symmnumber: 1
zpe: 849738.4 jmol-1
zpe.correction: 0.323648 hartree
zpe.thermalcorrener: 0.341175 hartree
zpe.thermalcorrenthalpy: 0.342119 hartree
zpe.thermalcorrgfe: 0.280452 hartree
zpe.sumelectzpe: -620.746867 hartree
zpe.sumelectthermal: -620.729340 hartree
zpe.sumelectthermalent: -620.728396 hartree
zpe.sumelectthermalfe: -620.790063 hartree
dipole: 2.0600 0.3685 -0.0001
dipole: 2.0927
quadrupole: -84.7939 -90.1272 -96.2877
quadrupole: -4.2138 -0.0007 0.0000
quadrupole: 5.6090 0.2757 -5.8847 -4.2138 -0.0007 0.0000
hfenergy: -621.070515 hartree
pointgroup: C01 [X(C14H22O1)]
dipole: -0.8113799 0.1398279 0.0000283 debye
polarizability: 190.8288624|0.7897415|169.2563267|-0.0070491|0.0015119|110.8199109 unknown
InChI: InChI=1S/C14H22O/c1-8(2)12-10(5)7-11(6)13(9(3)4)14(12)15/h7-9,15H,1-6H3
charge 0 multiplicity 1
37 atoms
O  0.081474 -2.011416 -0.000121
C  -1.24654 0.071372 0.000027
C  1.267542 0.079559 -0.00019
C  -2.576946 -0.701681 0.000121
C  2.594478 -0.690173 -0.000343
C  0.013946 -0.594547 -0.00009
C  -1.23952 1.497483 0.000046
C  1.242733 1.504167 -0.000147
C  -0.001527 2.180048 -0.000033
C  -2.812063 -1.537855 1.293443
C  -2.812172 -1.537979 -1.293101
C  2.78734 -1.545165 -1.283867
C  2.78759 -1.545251 1.283083
C  -2.524642 2.315852 0.000161
C  2.520507 2.332812 -0.000229
H  -3.377332 0.058402 0.000123
H  3.405128 0.061926 -0.0004
H  -0.004592 3.276801 -0.000007
H  -2.685794 -0.906038 2.190472
H  -3.83879 -1.94887 1.29963
H  -2.11968 -2.394405 1.407015
H  -2.119796 -2.39454 -1.406644
H  -3.838899 -1.948997 -1.299161
H  -2.685978 -0.90625 -2.190203
H  2.030276 -2.3440 -1.339209
H  3.790957 -2.011779 -1.281259
H  2.701503 -0.921193 -2.19287
H  2.701928 -0.921343 2.192147
H  3.791208 -2.011864 1.280248
H  2.030538 -2.344091 1.338516
H  -3.150026 2.113754 -0.890573
H  -3.149867 2.113753 0.891009
H  -2.290681 3.393945 0.000141
H  3.14647 2.130358 0.889319
H  3.146287 2.130462 -0.889931
H  2.280246 3.40976 -0.000141
H  -0.826302 -2.397517 -0.000082
