program: Gaussian 09
title: 000198370
version: EM64L-G09RevD.01
frameworkgroup: C1[X(C3H9O2PS)]
method: RPBEPBE
basis: SDD
operation: Freq
keyword: #p
keyword: freq=noraman
keyword: PBEPBE/SDD
title: #p freq=noraman PBEPBE/SDD
converged: YES YES NO NO
title: Mulliken charges:
elementType: S P O O C C C H H H H H H H H H
charge: -0.048723 0.959183 -0.497082 -0.617626 -0.875204 -0.846993 -0.474744 0.271322 0.286169 0.275152 0.319572 0.264563 0.267186 0.242552 0.232198 0.242476
chargesum: 0.00000
title: Mulliken charges with hydrogens summed into heavy atoms:
elementType: S P O O C C C
charge: -0.048723 0.959183 -0.497082 -0.617626 -0.042561 0.004329 0.242481
polarizability: 9.92364115e+01 6.31402057e+00 7.56061678e+01 1.02530521e-01 -4.38558575e-01 7.44124249e+01
1716.lowfreq: -15.4127 0.0003 0.0010 0.0025 4.4140 11.7046 61.3619 79.8441 111.6137
frequency: 61.0593 79.6201 111.5285 144.1650 152.3897 163.9438 174.9697 194.3914 246.8098 257.2278 310.1009 393.3831 402.7730 612.2113 642.0123 716.5435 932.4192 951.7995 977.6944 986.6106 1010.8891 1030.3588 1117.1922 1134.3106 1343.7763 1356.7511 1425.8895 1429.9545 1434.3028 1457.1165 1459.2091 1466.8670 1472.9945 2977.7885 2983.0691 3025.4593 3078.7813 3107.7838 3127.6433 3147.9243 3149.0672 3155.5893
redmass: 3.0665 3.9392 1.0545 3.5223 1.0800 3.1097 1.1058 3.4741 4.1238 6.5219 7.9432 5.2887 9.2121 7.3728 7.8880 6.8272 1.7572 1.4428 1.2597 4.1925 1.2212 3.8330 1.2532 1.3118 1.1605 1.1176 1.1201 1.0455 1.0458 1.0481 1.0484 1.0548 1.0523 1.0310 1.0350 1.0312 1.1040 1.0957 1.1025 1.1023 1.1069 1.1025
irintensity: 2.3351 4.7067 0.0996 12.0055 0.8777 7.2874 0.8347 1.3565 8.8819 5.0229 1.2323 42.7859 66.6262 92.7739 4.0066 43.3415 18.5953 95.0239 45.9324 80.9796 8.2984 95.8443 0.0960 1.4357 18.1342 3.3181 4.2103 9.5933 14.1034 6.9466 20.6690 17.3543 9.5167 43.4580 33.6446 0.7373 26.6666 4.8929 14.8803 1.1657 12.3538 1.0083
temp: 298.150 k
press: 1.00000 atm
elementType: 16 15 8 8 6 6 6 1 1 1 1 1 1 1 1 1
symmnumber: 1
zpe: 319429.1 jmol-1
zpe.correction: 0.121664 hartree
zpe.thermalcorrener: 0.132619 hartree
zpe.thermalcorrenthalpy: 0.133563 hartree
zpe.thermalcorrgfe: 0.084863 hartree
zpe.sumelectzpe: -1008.849906 hartree
zpe.sumelectthermal: -1008.838951 hartree
zpe.sumelectthermalent: -1008.838007 hartree
zpe.sumelectthermalfe: -1008.886707 hartree
dipole: 0.1563 -0.1786 -1.1955
dipole: 1.2188
quadrupole: -54.7473 -49.0790 -67.1217
quadrupole: 0.4825 -2.9940 -2.6938
quadrupole: 2.2353 7.9037 -10.1390 0.4825 -2.9940 -2.6938
hfenergy: -1008.9715699 hartree
pointgroup: C01 [X(C3H9O2P1S1)]
dipole: -0.1272552 0.161079 -0.4333534 debye
dipolederiv: -0.6084815 -0.0768152 0.1020415 -0.1309512 -0.3245512 0.0292816 0.1736939 0.0390738 -0.3321205 1.8701401 -0.1401445 -0.280367 0.0464065 1.5388049 0.0192305 -0.2865903 -0.1395675 1.1668851 -0.8617776 0.267021 0.1178964 0.3192807 -1.2155958 -0.2011616 0.040567 -0.1074782 -0.5190018 -0.67391 0.0068194 0.0382119 -0.0670051 -0.659471 0.03764 0.0829056 0.1041164 -0.7184942 -0.2981361 -0.0993898 -0.0251758 -0.0004693 -0.2504321 -0.0483363 0.0303795 -0.0352358 -0.2128492 0.1904551 0.020678 0.0718911 -0.0157914 0.0409964 0.0377276 0.2058893 0.073428 -0.0529907 0.1784612 0.1115738 0.0045181 -0.2407219 0.6519184 0.1188642 -0.1526252 0.2001309 0.3069772 0.0445744 0.0635217 -0.0045595 0.0746284 0.0069063 -0.0145522 -0.000255 -0.0121624 0.1142566 -0.0065578 -0.0600421 0.0617194 -0.0925226 0.0722849 0.0118197 0.0301295 -0.0196501 0.0785031 0.1082594 -0.0141493 -0.0361807 -0.0092459 0.0796218 0.0390662 -0.0416312 0.0280271 -0.0224643 0.1272059 -0.0096644 0.0404374 0.0104261 0.1135307 0.0300403 -0.046688 0.0045785 0.0208459 -0.0201299 -0.0750258 -0.0552639 -0.0810369 -0.0718655 -0.0268671 -0.0757327 -0.0328983 0.0874361 -0.1100106 0.0837891 -0.0098945 0.084249 0.0310457 -0.0407547 -0.0291397 -0.0413724 0.0826618 -0.0389906 0.1091362 -0.0441472 0.1086058 -0.0183117 -0.0068205 -0.0443618 -0.0037597 0.0986775 -0.0131081 -0.1600703 0.0563439 -0.0286566 -0.0070915 -0.0061991 0.0893933 0.0147827 0.0333572 0.1120061 -0.027238 -0.0374712 0.0228044 0.0122096 0.0210211 0.024066 -0.072013 -0.1316798 unknown
polarizability: 99.1980797|5.8209607|75.1857729|-2.7130543|-0.2907403|74.8711516 unknown
InChI: InChI=1S/C2H6O2P.CH3S/c1-4-5(2)3;1-2/h1-2H3;1H3
charge 0 multiplicity 1
16 atoms
S  1.293879 0.469959 -1.441539
P  -0.457398 -0.290628 -0.117955
O  -1.726679 0.878493 -0.345631
O  0.034842 -0.528494 1.39003
C  -1.241892 -1.713816 -1.00882
C  2.603122 0.505715 -0.073899
C  -1.538847 2.229187 0.221399
H  -0.525826 -2.548272 -1.036465
H  -2.153731 -2.010785 -0.467697
H  -1.496533 -1.401495 -2.032364
H  2.12539 0.172532 0.866195
H  2.971779 1.536254 0.028843
H  3.415214 -0.180379 -0.353478
H  -2.446318 2.78395 -0.059063
H  -0.64647 2.712279 -0.219703
H  -1.443129 2.183201 1.320648
