program: Gaussian 09
title: 000198376
version: EM64L-G09RevD.01
frameworkgroup: C1[X(C14H15N3O)]
method: RPBEPBE
basis: SDD
operation: Freq
keyword: #p
keyword: freq=noraman
keyword: PBEPBE/SDD
title: #p freq=noraman PBEPBE/SDD
converged: YES YES NO NO
title: Mulliken charges:
elementType: O N N N C C C C C C C C C C C C C C H H H H H H H H H H H H H H H
charge: -0.392196 -0.103684 -0.111041 -0.133817 0.417260 -0.390359 -0.387797 -0.353480 0.148403 -0.269856 -0.355316 -0.676443 0.178552 -0.301766 -0.346401 -0.202609 -0.205474 -0.241934 0.254403 0.220258 0.268876 0.230907 0.275511 0.248386 0.241366 0.214847 0.230562 0.342868 0.272116 0.247703 0.224857 0.227697 0.227599
chargesum: 0.00000
title: Mulliken charges with hydrogens summed into heavy atoms:
elementType: O N N N C C C C C C C C C C C C C C
charge: -0.049328 -0.103684 -0.111041 -0.133817 0.417260 0.084302 -0.118921 -0.122573 0.148403 0.005655 -0.106929 0.010331 0.178552 -0.029650 -0.098698 0.022248 0.022223 -0.014335
polarizability: 4.84277218e+02 -2.21562194e-01 1.68096639e+02 8.60586956e+00 8.86931062e+00 8.50729203e+01
1716.lowfreq: -16.5629 -7.4077 -0.0006 -0.0005 0.0009 2.5470 21.1831 31.1501 55.4880
frequency: 20.9403 31.0864 55.4708 65.7731 77.4498 103.9296 130.8722 167.9084 184.4911 203.4375 238.4326 270.4630 286.9028 315.8472 363.3151 386.6591 405.9136 408.0572 425.9577 465.9126 499.8985 507.3253 532.0077 548.4483 605.0730 610.6587 628.8456 693.1214 701.8660 739.6142 774.5301 780.9401 813.0409 814.5585 851.3351 852.8053 896.7708 904.4669 937.5258 937.7759 961.1922 984.9068 985.1146 988.5562 992.9076 998.7970 1013.8132 1060.2876 1073.5148 1092.5785 1115.1961 1140.0789 1145.0383 1157.2280 1168.4466 1189.3914 1244.7596 1264.2748 1294.8907 1304.0137 1320.2732 1339.2156 1342.9968 1363.1094 1375.8696 1385.3891 1388.2210 1441.1800 1448.8558 1463.0132 1464.2439 1473.3764 1482.7357 1490.7741 1553.1013 1581.2054 1601.2323 1616.1733 2985.7996 3024.7545 3070.7224 3086.3534 3097.2521 3124.5934 3135.6802 3145.5598 3150.4922 3155.9732 3163.3566 3167.9115 3170.0272 3177.8036 3331.3839
redmass: 3.7676 4.6141 5.0022 4.1663 3.0794 5.1505 4.6610 3.2893 2.9160 2.0350 2.5436 5.1276 3.8483 1.3218 3.4927 3.5416 3.9899 3.0327 3.3506 4.4814 2.9878 5.1060 4.7600 2.7247 5.7566 6.0340 7.1972 1.8787 5.4559 3.6261 1.2513 1.7868 1.4486 4.2422 1.4544 1.3095 6.5033 3.0129 1.6074 2.5566 1.3718 5.5385 1.4016 2.4786 1.3734 1.3200 2.0724 2.8566 1.4923 2.1805 1.6008 2.0005 1.6491 1.2313 1.0598 1.6078 2.7700 1.3868 1.3318 1.4292 1.2310 1.4432 5.9515 2.7526 2.5806 1.3163 7.5396 2.5071 4.2826 1.6872 1.2910 1.0456 1.0590 2.9824 7.0196 6.2064 6.2815 6.5544 1.0355 1.0616 1.1005 1.0998 1.1023 1.0849 1.0888 1.0873 1.0930 1.0877 1.0959 1.0961 1.0994 1.0959 1.0678
irintensity: 0.2255 2.3181 0.4732 3.3058 2.3079 3.2238 34.8199 6.6150 0.6320 13.1282 2.3116 3.1282 2.4471 94.1688 17.7253 13.4268 72.6053 12.2044 9.7557 35.0464 16.2824 2.9754 27.4795 33.9608 4.6282 1.9911 2.4652 50.5232 5.5307 14.0265 9.6377 39.8024 17.0553 4.9620 48.2294 16.8266 0.2693 3.1794 8.7639 19.8064 2.4199 0.0395 0.0029 0.6730 0.4521 0.9550 10.5343 40.4659 11.9275 62.9063 7.1858 30.5639 22.7949 124.3300 0.0112 5.5462 14.3991 69.4742 7.2088 15.5489 29.4684 118.1194 186.9880 48.7371 9.6326 23.9103 2.1719 9.3192 2.5645 11.3148 6.6713 16.1402 3.6620 119.7102 21.0446 2.4655 2.4078 372.7917 24.5926 32.6028 4.0020 31.9041 48.5083 3.5845 12.2778 7.5573 27.5847 0.0729 23.1312 23.6843 34.6203 4.8762 31.6983
temp: 298.150 k
press: 1.00000 atm
elementType: 8 7 7 7 6 6 6 6 6 6 6 6 6 6 6 6 6 6 1 1 1 1 1 1 1 1 1 1 1 1 1 1 1
symmnumber: 1
zpe: 685059.7 jmol-1
zpe.correction: 0.260925 hartree
zpe.thermalcorrener: 0.277606 hartree
zpe.thermalcorrenthalpy: 0.278550 hartree
zpe.thermalcorrgfe: 0.214827 hartree
zpe.sumelectzpe: -780.578916 hartree
zpe.sumelectthermal: -780.562236 hartree
zpe.sumelectthermalent: -780.561291 hartree
zpe.sumelectthermalfe: -780.625014 hartree
dipole: -3.1193 -1.3473 1.8181
dipole: 3.8537
quadrupole: -78.1493 -97.3138 -110.3693
quadrupole: 7.8653 -7.2707 4.8793
quadrupole: 17.1282 -2.0364 -15.0918 7.8653 -7.2707 4.8793
hfenergy: -780.8398417 hartree
pointgroup: C01 [X(C14H15N3O1)]
dipole: 1.205436 0.9100109 -0.1323282 debye
polarizability: 484.4065371|3.3944463|94.4154105|3.1764927|-27.8821733|158.6248303 unknown
InChI: InChI=1S/C14H15N3O/c1-2-17(18)14-10-8-13(9-11-14)16-15-12-6-4-3-5-7-12/h3-11,18H,2H2,1H3
charge 0 multiplicity 1
33 atoms
O  4.947715 -0.589059 1.796125
N  4.494007 -0.404537 0.423696
N  -1.100842 0.097295 -0.386905
N  -1.907991 -0.255673 0.588071
C  3.109424 -0.260559 0.250436
C  5.52016 0.238424 -0.417588
C  2.21052 -0.679782 1.285995
C  2.565489 0.253678 -0.969091
C  0.282669 -0.055933 -0.101638
C  0.826407 -0.574617 1.111497
C  1.176043 0.344719 -1.132185
C  5.672626 1.761844 -0.19298
C  -3.300779 -0.103492 0.286277
C  -3.823496 0.367271 -0.953121
C  -4.189438 -0.464333 1.334148
C  -5.216311 0.471218 -1.126706
C  -5.584206 -0.356503 1.152136
C  -6.102549 0.111389 -0.078527
H  6.46943 -0.27952 -0.198844
H  5.269566 0.017551 -1.470132
H  2.622564 -1.116542 2.199472
H  3.222192 0.579092 -1.780875
H  0.134445 -0.896844 1.895782
H  0.746932 0.737794 -2.059964
H  4.723548 2.294413 -0.380427
H  6.001159 1.980344 0.839631
H  6.43764 2.170104 -0.877333
H  4.706667 0.247574 2.29851
H  -3.122553 0.638882 -1.748339
H  -3.759716 -0.82428 2.275052
H  -5.621036 0.832492 -2.079282
H  -6.264748 -0.636145 1.963925
H  -7.185638 0.195034 -0.223013
