program: Gaussian 09
title: 000198544
version: EM64L-G09RevD.01
frameworkgroup: C1[X(C13H26NO5PS2)]
method: RPBEPBE
basis: SDD
operation: Freq
keyword: #p
keyword: freq=noraman
keyword: PBEPBE/SDD
title: #p freq=noraman PBEPBE/SDD
converged: NO YES NO NO
title: Mulliken charges:
elementType: S S P O O O O O N C C C C C C C C C C C C C H H H H H H H H H H H H H H H H H H H H H H H H H H
charge: 0.076837 -0.220337 0.578540 -0.290908 -0.235571 -0.275390 -0.514705 -0.455248 -0.407190 -0.049769 -0.151787 -0.701712 -0.717062 0.228070 0.323816 -0.815289 -0.257536 -0.666786 -0.198413 -0.214358 -0.676726 -0.659893 0.232293 0.285607 0.215807 0.236477 0.212736 0.213738 0.227473 0.218048 0.383989 0.295219 0.299766 0.241113 0.209145 0.250207 0.242209 0.215753 0.242965 0.219905 0.230845 0.230317 0.232473 0.242241 0.219909 0.229928 0.258608 0.214647
chargesum: 0.00000
title: Mulliken charges with hydrogens summed into heavy atoms:
elementType: S S P O O O O O N C C C C C C C C C C C C C
charge: 0.076837 -0.220337 0.578540 -0.290908 -0.235571 -0.275390 -0.514705 -0.455248 -0.023201 0.182524 0.133820 -0.036691 -0.057802 0.228070 0.323816 -0.220304 0.192721 0.041383 0.264457 0.246804 0.017896 0.043290
polarizability: 2.55814288e+02 1.93555763e+01 2.32208446e+02 2.57963760e+00 -2.18711890e+00 2.00088794e+02
1716.lowfreq: -9.5578 -4.0563 -0.0021 0.0016 0.0016 3.0106 21.1708 23.4169 36.5379
frequency: 20.7081 23.2616 36.3977 41.8970 46.2679 47.9612 51.4460 55.5808 60.5434 65.0479 79.9349 87.5498 93.9201 103.8895 110.8481 114.8318 132.5380 154.5495 165.3602 189.7790 197.9737 202.5990 216.6271 230.1306 231.6394 236.1934 255.8718 267.0667 283.5463 284.9672 295.7179 299.7908 315.6483 322.0714 339.5950 387.2021 398.8714 435.5127 447.6927 465.2053 537.4802 551.2693 581.6995 608.7790 649.6026 660.6488 684.5213 696.8070 709.8974 747.7986 772.1377 806.9729 812.1763 815.6215 819.3325 854.0698 873.9868 875.8770 891.2022 919.4702 943.5532 951.7609 962.3283 1009.7512 1016.2710 1020.6498 1046.0781 1096.3232 1102.5252 1105.0805 1116.4700 1125.6839 1130.6601 1134.2794 1148.0791 1154.7074 1180.0892 1208.9219 1236.1132 1251.6532 1258.3057 1262.6018 1269.6043 1277.7148 1291.7167 1321.0064 1346.6538 1350.0432 1352.6660 1354.3014 1380.0408 1393.3364 1395.3905 1396.0714 1399.3363 1420.6454 1454.9971 1457.3037 1459.8374 1461.2186 1462.2149 1469.3647 1473.3143 1476.8576 1479.5487 1481.2917 1485.5251 1486.7018 1487.9956 1492.7422 1612.2007 1636.7278 2978.3664 2983.9230 2986.8191 2991.3400 2991.8559 2993.2959 2995.5094 2997.9878 3024.6383 3030.1221 3043.3233 3055.7330 3059.6888 3071.2471 3077.8680 3079.4827 3087.6468 3088.7728 3090.6042 3092.0084 3092.4110 3104.8779 3109.3450 3118.5487 3128.9180 3469.1921
redmass: 3.8457 4.3336 4.5193 3.7770 3.2545 2.8200 3.5682 2.3789 4.3395 4.7511 3.2200 4.0051 3.4571 4.5539 5.4777 4.3630 4.0261 3.4925 5.1322 1.8764 1.7881 1.2364 4.3317 3.2539 2.8278 1.2585 1.6828 1.2566 3.3542 3.5228 3.2873 3.3261 4.2858 4.7168 3.6518 2.3647 6.1597 3.1921 7.2797 3.5957 6.6232 11.6205 2.6219 5.3229 2.0208 6.3597 3.6476 4.1174 3.6876 5.6654 2.7927 1.0946 1.1264 1.7210 2.5910 4.1850 1.9096 3.6108 3.1005 1.1949 2.4622 2.5751 1.7081 2.3391 3.1011 2.7440 1.9290 2.1347 2.2328 2.1887 2.5931 1.4230 1.4171 1.4296 2.0542 1.7111 2.1649 3.7341 1.2636 1.1437 1.1523 1.3242 1.3421 1.1325 1.4133 1.4786 1.3382 1.2476 1.3086 1.2650 1.2171 1.2217 1.2318 1.2408 1.2135 1.1316 1.0627 1.0684 1.0457 1.0707 1.0452 1.0726 1.0953 1.1787 1.0504 1.2634 1.0678 1.1200 1.0660 1.0774 6.7816 9.2875 1.0354 1.0358 1.0549 1.0840 1.0359 1.0382 1.0369 1.0566 1.0592 1.0836 1.0576 1.1071 1.1079 1.0994 1.0994 1.0992 1.0979 1.0982 1.1027 1.0992 1.0996 1.1027 1.1027 1.1043 1.1069 1.0790
irintensity: 0.7158 0.4319 0.6100 0.9693 2.0287 0.7469 1.0755 1.1347 0.7074 5.9258 0.8837 3.5515 0.5429 1.5390 2.2384 0.5728 2.6054 3.6281 0.9767 4.9538 2.8466 1.3096 7.7793 2.8020 6.6392 0.6207 1.6407 0.7105 2.3482 2.8228 0.6202 6.2654 5.6904 3.8504 9.4720 5.6001 20.3799 4.9409 12.6870 13.3529 15.2911 79.3785 20.5871 13.4060 90.8747 66.4101 71.2935 64.4655 18.2489 5.1566 13.9663 4.1299 8.3231 2.4677 1.5366 188.3649 0.8551 60.7912 20.3447 7.0356 19.6384 5.0054 6.1007 112.6636 57.3082 77.5468 26.6301 21.0214 11.1770 8.8216 29.7717 16.5183 4.8268 3.7917 50.1050 38.2217 35.4298 113.9029 10.9434 1.5782 0.7495 1.2282 2.8239 2.3144 36.0962 1.8180 3.3950 5.9649 5.1819 2.0026 18.7298 20.1079 26.8307 18.3087 24.7543 29.3020 20.1110 15.9846 7.7486 14.4180 21.0195 4.3024 29.8448 27.8534 19.0703 83.8402 18.9986 59.2160 5.3695 41.1603 181.7435 139.1926 23.9691 27.0427 22.9740 8.4001 15.0065 20.6239 18.2622 22.7036 32.4987 7.4875 3.1029 11.7569 11.2845 7.2436 44.4548 70.7607 31.2619 22.3645 10.7841 21.2719 26.1725 38.1818 18.8474 26.2097 5.1369 97.1757
temp: 298.150 k
press: 1.00000 atm
elementType: 16 16 15 8 8 8 8 8 7 6 6 6 6 6 6 6 6 6 6 6 6 6 1 1 1 1 1 1 1 1 1 1 1 1 1 1 1 1 1 1 1 1 1 1 1 1 1 1
symmnumber: 1
zpe: 1015015.7 jmol-1
zpe.correction: 0.386599 hartree
zpe.thermalcorrener: 0.416131 hartree
zpe.thermalcorrenthalpy: 0.417075 hartree
zpe.thermalcorrgfe: 0.322888 hartree
zpe.sumelectzpe: -2077.445591 hartree
zpe.sumelectthermal: -2077.416060 hartree
zpe.sumelectthermalent: -2077.415115 hartree
zpe.sumelectthermalfe: -2077.509302 hartree
dipole: -1.1483 3.5214 -3.1799
dipole: 4.8816
quadrupole: -173.1499 -154.4840 -147.7081
quadrupole: 1.2793 8.3484 -1.3923
quadrupole: -14.7026 3.9633 10.7392 1.2793 8.3484 -1.3923
hfenergy: -2077.8321904 hartree
pointgroup: C01 [X(C13H26N1O5P1S2)]
dipole: 0.1139157 1.2957836 1.4130063 debye
polarizability: 259.6562269|-16.210073|226.735617|6.9707643|3.5670276|201.7196846 unknown
InChI: InChI=1S/C9H16NO3S.C4H10O2PS/c1-4-13-9(12)8(6(2)3)10-7(11)5-14;1-3-5-7(8)6-4-2/h6,8,10H,4-5H2,1-3H3;3-4H2,1-2H3
charge 0 multiplicity 1
48 atoms
S  -2.306174 -2.843048 -0.045943
S  -4.761734 -0.09975 -0.44769
P  -2.783191 -0.604823 -0.172791
O  0.760987 1.831094 0.47963
O  2.359286 1.986885 -1.209966
O  1.082415 -2.742026 -0.841377
O  -1.97262 -0.027518 1.257663
O  -1.619441 -0.003842 -1.318891
N  0.896907 -0.866949 0.545877
C  3.363744 -0.272718 0.752816
C  2.028103 -0.168766 -0.080411
C  3.823183 -1.743983 0.849926
C  3.234352 0.364886 2.154363
C  1.737246 1.304207 -0.364937
C  0.504847 -2.117332 0.101305
C  -0.652178 -2.733966 0.894586
C  0.41697 3.278034 0.282475
C  -0.524242 3.471302 -0.909228
C  -2.570748 1.10436 2.027999
C  -1.743354 -0.464446 -2.740493
C  -1.708916 1.266477 3.276519
C  -0.38181 -0.234723 -3.388942
H  4.116387 0.295204 0.168693
H  2.217555 -0.658035 -1.05434
H  3.104049 -2.342761 1.438022
H  3.909433 -2.210508 -0.146839
H  4.805735 -1.802006 1.353321
H  2.460326 -0.155443 2.749331
H  2.96674 1.435668 2.104066
H  4.191804 0.278734 2.69925
H  0.237377 -0.313663 1.106545
H  -0.850633 -2.214597 1.843133
H  -0.417944 -3.795759 1.08089
H  1.357819 3.840849 0.147992
H  -0.055783 3.555747 1.238727
H  -0.001541 3.263464 -1.857047
H  -1.397122 2.800849 -0.837761
H  -0.880198 4.518189 -0.931862
H  -3.620639 0.857313 2.271846
H  -2.55504 2.011831 1.395973
H  -2.547646 0.122189 -3.221183
H  -2.012157 -1.539055 -2.749132
H  -1.726855 0.34899 3.889258
H  -0.663811 1.493876 3.004062
H  -2.10037 2.09914 3.889883
H  -0.075633 0.822327 -3.305998
H  0.384228 -0.87174 -2.916036
H  -0.43731 -0.495457 -4.46229
