program: Gaussian 09
title: 000198381
version: EM64L-G09RevD.01
frameworkgroup: C1[X(C9H10NO7P)]
method: RPBEPBE
basis: SDD
operation: Freq
keyword: #p
keyword: freq=noraman
keyword: PBEPBE/SDD
title: #p freq=noraman PBEPBE/SDD
converged: YES YES NO NO
title: Mulliken charges:
elementType: P O O O O O O O N C C C C C C C C C H H H H H H H H H H
charge: 1.400740 -0.541724 -0.499459 -0.489435 -0.589668 -0.197605 -0.194087 -0.209414 0.015283 0.408396 0.261518 -0.490117 0.272454 -0.322554 -0.333788 -0.168642 -0.484020 -0.475871 0.306958 0.307336 0.289785 0.236947 0.251597 0.239600 0.255639 0.242567 0.258038 0.249528
chargesum: 0.00000
title: Mulliken charges with hydrogens summed into heavy atoms:
elementType: P O O O O O O O N C C C C C C C C C
charge: 1.400740 -0.541724 -0.499459 -0.489435 -0.589668 -0.197605 -0.194087 -0.209414 0.015283 0.408396 0.261518 -0.183160 0.272454 -0.015219 -0.044004 0.068305 0.262816 0.274263
polarizability: 2.27863927e+02 4.73481017e+00 1.71749747e+02 -7.24432925e+00 6.37969489e+00 9.25865851e+01
1716.lowfreq: -5.6246 -0.0017 -0.0015 -0.0013 5.6048 9.0398 16.9767 18.5746 38.9144
frequency: 16.7143 18.1405 38.8101 51.1916 61.0994 63.8910 76.3182 84.4521 97.1150 131.4600 152.8823 156.0535 168.7784 185.6813 224.0868 251.0362 277.1747 285.6182 321.8254 336.0895 360.4491 394.6131 417.5265 438.8456 452.8150 520.5873 572.0670 578.1323 597.5149 639.2576 663.5546 687.4759 703.4633 725.9006 764.1920 786.3505 861.8968 926.0889 949.1162 959.4738 962.7795 974.8678 992.2588 1056.6949 1062.7608 1112.5039 1113.0180 1126.9362 1128.9723 1132.3406 1170.7405 1204.1730 1216.6217 1259.2824 1341.8142 1376.9709 1397.9080 1425.3413 1426.4138 1426.6365 1457.4180 1458.3297 1461.3649 1470.4517 1472.5526 1566.4873 1583.9172 1613.6337 2996.5895 3002.9847 3019.5996 3103.5156 3115.3150 3140.2823 3145.8471 3156.8158 3166.0253 3185.3349
redmass: 3.7919 4.7439 1.2253 14.0355 3.4854 3.8644 4.2767 4.4113 4.6195 1.1300 4.6118 5.1522 9.3737 5.7399 7.7537 5.2934 4.8949 7.6420 9.6132 8.8645 7.4419 8.8096 8.3461 4.2489 5.2101 7.4689 7.1176 5.1167 9.1469 7.4316 5.1761 9.5990 10.6589 5.3526 7.7523 9.0407 1.4117 1.4601 7.6538 11.9465 4.1406 1.7410 1.3678 5.5688 14.7667 1.2360 1.2346 1.9203 1.2855 1.3604 1.6084 7.0995 2.9237 1.7191 2.7017 2.0427 9.7307 1.2983 2.1155 1.1755 1.1026 1.0520 2.4011 1.0534 1.0596 6.9704 8.0462 7.2217 1.0291 1.0287 1.0894 1.1062 1.1057 1.1044 1.1055 1.0924 1.0919 1.0950
irintensity: 1.3418 2.5587 0.1764 0.9858 0.6077 5.5866 19.5757 0.4660 2.5029 0.7107 3.9532 0.9212 0.3273 11.6360 5.1683 13.5139 2.5583 9.7304 27.2581 29.7124 14.3411 4.2102 11.2521 3.6108 30.9925 13.0441 11.5929 7.1315 33.2290 41.9848 42.6815 133.0367 143.2548 42.1733 298.5546 7.8978 43.7924 19.9431 258.4657 193.9442 51.2246 13.9898 1.4294 17.6208 123.6048 0.7894 0.7006 36.9119 1.2276 4.3842 14.2064 645.1371 20.5734 141.5895 110.1210 66.9024 10.6852 2.5444 5.9182 4.1608 5.5137 9.8781 92.9826 25.6691 5.9674 174.3279 82.2950 119.6507 43.8196 31.2242 27.6750 21.4684 20.0537 8.0329 10.8028 2.4492 8.3049 1.7413
temp: 298.150 k
press: 1.00000 atm
elementType: 15 8 8 8 8 8 8 8 7 6 6 6 6 6 6 6 6 6 1 1 1 1 1 1 1 1 1 1
symmnumber: 1
zpe: 496589.2 jmol-1
zpe.correction: 0.189141 hartree
zpe.thermalcorrener: 0.208811 hartree
zpe.thermalcorrenthalpy: 0.209755 hartree
zpe.thermalcorrgfe: 0.136964 hartree
zpe.sumelectzpe: -1270.026450 hartree
zpe.sumelectthermal: -1270.006780 hartree
zpe.sumelectthermalent: -1270.005836 hartree
zpe.sumelectthermalfe: -1270.078627 hartree
dipole: 6.1905 0.2364 2.4854
dipole: 6.6750
quadrupole: -123.9228 -118.8604 -108.9192
quadrupole: 8.5003 11.1482 -6.9727
quadrupole: -6.6887 -1.6263 8.3150 8.5003 11.1482 -6.9727
hfenergy: -1270.2155908 hartree
pointgroup: C01 [X(C9H10N1O7P1)]
dipole: 2.4511159 0.121919 -0.9347332 debye
polarizability: 227.2540764|-8.8712933|162.0560475|7.8032362|26.9377116|102.890135 unknown
InChI: InChI=1S/C9H10NO7P/c1-15-18(14,16-2)17-8-3-4-9(10(12)13)7(5-8)6-11/h3-6H,1-2H3
charge 0 multiplicity 1
28 atoms
P  3.20245 0.236782 0.364641
O  1.754343 -0.74468 0.272024
O  3.344307 0.61076 -1.314646
O  4.32418 -0.98853 0.726029
O  3.228137 1.464567 1.361956
O  -2.416387 -2.721407 -1.606319
O  -3.842671 2.304627 0.425429
O  -4.589647 0.183098 0.056427
N  -3.639184 1.048283 0.207785
C  0.445769 -0.230809 0.228654
C  -1.873744 -0.670364 -0.447816
C  -0.512549 -1.050519 -0.39835
C  -2.234784 0.574475 0.150375
C  0.078714 1.007507 0.814397
C  -1.268352 1.404981 0.760042
C  -2.793659 -1.584851 -1.219652
C  4.098135 1.834865 -1.705319
C  4.376802 -2.239078 -0.08331
H  -0.217111 -1.994577 -0.866771
H  0.825836 1.633368 1.312808
H  -1.590998 2.350589 1.203116
H  -3.804962 -1.201834 -1.453943
H  3.798821 2.017447 -2.747298
H  5.184325 1.650207 -1.643206
H  3.818038 2.68804 -1.063947
H  4.529948 -2.004142 -1.150762
H  3.449925 -2.817636 0.058396
H  5.242819 -2.780171 0.323561
