program: Gaussian 09
title: 000198383
version: EM64L-G09RevD.01
frameworkgroup: C1[X(C12H15N3O6)]
method: RPBEPBE
basis: SDD
operation: Freq
keyword: #p
keyword: freq=noraman
keyword: PBEPBE/SDD
title: #p freq=noraman PBEPBE/SDD
converged: YES YES NO NO
title: Mulliken charges:
elementType: O O O O O O N N N C C C C C C C C C C C C H H H H H H H H H H H H H H H
charge: -0.281381 -0.281606 -0.281583 -0.245858 -0.246149 -0.246075 -0.223117 -0.222597 -0.223139 -0.020088 -0.020263 -0.019977 -0.381007 -0.381901 -0.381602 -0.359977 -0.359754 -0.360097 0.271784 0.271739 0.271908 0.289232 0.289089 0.289347 0.249100 0.256522 0.249357 0.256134 0.249203 0.256686 0.216176 0.229049 0.216429 0.229123 0.216285 0.229005
chargesum: 0.00000
title: Mulliken charges with hydrogens summed into heavy atoms:
elementType: O O O O O O N N N C C C C C C C C C C C C
charge: -0.281381 -0.281606 -0.281583 -0.245858 -0.246149 -0.246075 -0.223117 -0.222597 -0.223139 0.269144 0.268826 0.269371 0.124615 0.123589 0.124288 0.085248 0.085799 0.085193 0.271784 0.271739 0.271908
polarizability: 1.87796136e+02 2.21304765e-02 1.87393675e+02 -1.75701429e-02 -2.68429518e-02 1.15697684e+02
1716.lowfreq: -8.6809 -6.4156 -0.0008 -0.0007 -0.0006 4.0405 25.7048 27.9729 30.2718
frequency: 25.6501 27.9382 30.2367 46.0355 49.7797 54.6402 79.2182 80.4077 81.1753 130.4125 132.1479 156.2140 235.9988 269.2867 270.1148 294.0334 297.0481 297.3618 339.9101 341.1973 360.8982 397.5550 399.4441 414.8892 441.8037 442.7482 547.9001 548.6471 614.8169 686.4887 693.1465 694.4120 694.6086 712.3892 712.6420 731.3324 752.3544 816.0941 816.5738 825.6793 864.6446 864.8358 884.9509 907.1461 908.3929 946.9784 974.6021 975.0992 1031.3487 1032.0970 1032.4588 1081.0930 1081.8019 1088.0402 1104.9608 1107.6870 1107.9755 1123.3138 1123.7559 1124.7430 1170.7264 1179.6369 1179.9473 1227.1811 1234.4125 1237.3480 1238.1036 1298.5647 1299.3832 1319.4511 1332.3142 1332.8274 1334.2669 1383.7523 1384.1061 1405.2147 1412.3947 1413.9409 1430.5729 1436.6918 1438.9278 1478.6528 1481.4091 1481.4636 1611.1994 1611.4389 1671.8239 3032.7046 3032.9847 3033.4328 3064.2840 3065.3958 3065.5144 3106.3857 3107.1529 3107.2680 3129.5133 3129.7607 3130.4339 3172.8068 3173.1888 3173.2748
redmass: 6.5895 6.4621 6.8428 4.8521 4.7689 4.6988 4.8218 7.0934 5.2084 4.9721 5.0224 9.1443 7.5620 3.9561 3.9767 3.9884 4.0556 4.3144 3.5605 3.6053 4.2430 3.1773 3.1996 2.2092 6.5589 6.1843 5.3395 5.3404 7.2329 6.2807 5.1874 6.8474 6.9130 8.6203 8.5986 5.6638 9.6368 2.8132 2.8449 3.1163 2.5186 2.4751 2.1545 2.0852 2.0713 1.6768 2.3383 2.3475 1.3181 1.3563 1.3580 2.4789 2.4778 2.5478 1.3721 1.3551 1.3575 1.3576 1.3521 1.3905 2.5836 2.6709 2.6802 5.0223 1.7119 1.6183 1.7155 1.7157 1.7249 1.5066 1.3861 1.3743 1.2905 2.8987 2.9318 1.7542 1.8401 1.8329 1.1020 1.2195 1.2038 1.1999 1.1956 1.1966 10.9453 10.9711 9.9139 1.0610 1.0608 1.0609 1.0535 1.0534 1.0534 1.1009 1.1006 1.1008 1.0938 1.0937 1.0937 1.1181 1.1181 1.1182
irintensity: 1.0046 0.8378 1.6514 7.5963 7.9069 3.7874 1.1257 0.9406 1.2350 1.7160 1.6415 6.4321 8.2832 0.0181 0.0029 7.1059 9.0909 11.5053 16.5859 16.4681 4.3668 19.4537 19.1652 25.1256 2.1963 2.4635 24.9275 25.0216 0.4779 1.0446 3.9116 5.7086 5.8513 3.0135 3.0941 6.5160 70.4895 18.1099 17.6176 13.5142 3.3778 3.3512 9.6694 20.9948 21.0418 1.0870 0.1088 0.1162 0.5669 1.9330 1.9699 27.0516 27.0617 4.3054 0.2071 2.9924 2.7476 10.2971 10.0722 5.6573 0.0185 3.7003 3.7499 1.3271 3.9677 2.0935 9.4358 146.3613 147.3560 0.3332 4.2703 4.1531 5.1515 196.8940 199.0332 1.8823 50.2059 49.9977 44.1533 169.0838 160.9075 3.1197 3.1298 2.2990 617.1258 618.1388 3.5999 15.2106 14.8081 13.8621 35.2302 46.7256 15.8365 3.4328 3.4576 3.4276 1.3469 1.3254 1.2653 23.9138 23.8190 24.3738
temp: 298.150 k
press: 1.00000 atm
elementType: 8 8 8 8 8 8 7 7 7 6 6 6 6 6 6 6 6 6 6 6 6 1 1 1 1 1 1 1 1 1 1 1 1 1 1 1
symmnumber: 1
zpe: 714523.5 jmol-1
zpe.correction: 0.272148 hartree
zpe.thermalcorrener: 0.292298 hartree
zpe.thermalcorrenthalpy: 0.293242 hartree
zpe.thermalcorrgfe: 0.220011 hartree
zpe.sumelectzpe: -1080.194841 hartree
zpe.sumelectthermal: -1080.174691 hartree
zpe.sumelectthermalent: -1080.173746 hartree
zpe.sumelectthermalfe: -1080.246978 hartree
dipole: 0.0257 0.0068 -3.8556
dipole: 3.8557
quadrupole: -108.7942 -108.7875 -129.3145
quadrupole: 0.1730 0.1165 0.0711
quadrupole: 6.8379 6.8445 -13.6824 0.1730 0.1165 0.0711
hfenergy: -1080.4669884 hartree
pointgroup: C01 [X(C12H15N3O6)]
dipole: -0.0125582 0.0098375 -1.5168482 debye
polarizability: 187.5617771|-0.1993838|187.6272567|-0.1728117|0.1651341|115.6984623 unknown
InChI: InChI=1S/C12H15N3O6/c16-10-13(1-7-4-19-7)11(17)15(3-9-6-21-9)12(18)14(10)2-8-5-20-8/h7-9H,1-6H2
charge 0 multiplicity 1
36 atoms
O  2.015287 -2.898148 1.656571
O  -3.477534 -0.289696 1.680335
O  1.491423 3.174248 1.675178
O  -0.718178 -2.604963 -0.843733
O  2.616478 0.680115 -0.842913
O  -1.895557 1.925249 -0.842085
N  0.973162 -0.975872 -0.77797
N  -1.330048 -0.35387 -0.773628
N  0.360033 1.329818 -0.774384
C  2.73162 -2.102649 0.589037
C  -3.175665 -1.310197 0.60667
C  0.451526 3.408404 0.603024
C  2.035767 -2.017901 -0.757513
C  -2.763729 -0.752377 -0.743849
C  0.731789 2.770743 -0.746034
C  3.2995 -3.408345 1.051521
C  -4.58155 -1.130575 1.088948
C  1.299129 4.546626 1.079332
C  -0.376607 -1.395776 -0.79384
C  1.398528 0.370853 -0.79393
C  -1.018991 1.024982 -0.79215
H  3.177232 -1.172978 0.960703
H  -2.599807 -2.169389 0.969032
H  -0.578886 3.330233 0.968018
H  2.775479 -1.769927 -1.539124
H  1.540745 -2.973546 -0.992613
H  -2.924772 -1.518129 -1.523075
H  -3.344582 0.154157 -0.977343
H  0.151109 3.291786 -1.527618
H  1.807932 2.819777 -0.976331
H  3.184161 -4.299867 0.420982
H  4.163782 -3.408344 1.726047
H  -5.297051 -0.5739 0.469479
H  -5.014535 -1.874212 1.768316
H  2.133903 4.895042 0.456977
H  0.865111 5.291328 1.756865
