program: Gaussian 09
title: 000198359
version: EM64L-G09RevD.01
frameworkgroup: C1[X(C14H13N3O)]
method: RPBEPBE
basis: SDD
operation: Freq
keyword: #p
keyword: freq=noraman
keyword: PBEPBE/SDD
title: #p freq=noraman PBEPBE/SDD
converged: YES YES NO NO
title: Mulliken charges:
elementType: O N N N C C C C C C C C C C C C C C H H H H H H H H H H H H H
charge: -0.234822 -0.368631 -0.375615 -0.052245 0.028158 0.239467 0.217004 -0.013891 -0.386015 0.331508 -0.560067 -0.778703 0.099592 -0.385367 -0.384395 -0.239159 -0.232696 -0.241668 0.271312 0.314055 0.318446 0.229777 0.259972 0.272669 0.240053 0.223443 0.253606 0.272174 0.226229 0.227334 0.228474
chargesum: 0.00000
title: Mulliken charges with hydrogens summed into heavy atoms:
elementType: O N N N C C C C C C C C C C C C C C
charge: -0.234822 -0.054576 -0.057170 -0.052245 0.028158 0.239467 0.217004 -0.013891 -0.114703 0.331508 -0.070318 -0.042537 0.099592 -0.131761 -0.112221 -0.012930 -0.005362 -0.013194
polarizability: 2.31030955e+02 7.07226650e+00 1.88023497e+02 3.16674603e+00 -1.67418828e+01 1.10544214e+02
1716.lowfreq: -10.9425 -5.9745 -0.0010 -0.0009 -0.0005 0.8591 46.9952 64.6883 78.8686
frequency: 46.9937 64.6835 78.8669 102.1418 109.5849 131.6469 160.3991 210.4961 236.8551 280.9188 296.9280 325.3185 353.2775 389.3035 395.9072 408.4933 425.6023 489.4759 514.7635 567.0548 588.9104 592.0014 613.8098 616.1938 632.1809 636.4333 662.6658 698.9224 704.2089 716.7875 745.2020 786.2239 813.2296 860.0551 869.5037 914.8436 935.9676 958.6865 968.5206 985.0756 989.7140 996.6724 999.1992 1027.8964 1042.4655 1057.4127 1082.1253 1109.0112 1167.7986 1171.6197 1186.1897 1202.1123 1234.5574 1284.1192 1306.0327 1316.4266 1321.6517 1329.7566 1381.0044 1387.0686 1407.7971 1418.4861 1432.1898 1450.6765 1454.9901 1467.9388 1478.7112 1484.8512 1531.5311 1539.0513 1585.0703 1597.2382 1610.1365 1640.5622 2928.1353 2974.2582 3045.1192 3102.4235 3114.2809 3122.4390 3132.1106 3144.6402 3156.9513 3168.4137 3239.6645 3520.6409 3592.8575
redmass: 3.9737 5.8728 4.5341 1.2925 2.6888 4.0847 4.1685 4.4011 4.6930 4.0104 4.2918 5.2110 4.4454 7.1665 4.2269 2.8999 5.1283 3.4166 3.3289 3.4489 2.2454 1.4559 2.3487 4.4110 3.9201 4.8065 2.4863 2.7778 2.0650 2.0975 3.0702 2.6074 5.9564 1.2463 5.2359 3.9723 1.5563 1.8858 4.1009 1.3923 5.4277 2.1169 1.4018 2.1092 1.4535 2.9528 1.5894 1.6108 1.7622 1.0807 1.1433 1.9392 1.8360 3.4900 1.9203 1.5024 2.7941 1.6470 8.3215 2.4038 1.3700 2.2469 2.2392 1.7268 1.2253 1.0881 1.5967 2.2016 5.3210 6.9651 6.0328 6.4264 6.1268 6.0576 1.0683 1.0402 1.0981 1.0927 1.0950 1.0847 1.0882 1.0933 1.0966 1.0993 1.0991 1.0760 1.0811
irintensity: 1.1738 0.6128 1.8162 0.0174 0.5302 0.6386 1.8221 0.8625 1.1833 9.4486 4.3510 1.6132 0.3358 0.1980 10.4593 0.1887 5.2965 4.2372 3.9333 8.7578 42.9787 85.2327 2.3459 6.3561 31.0766 18.9065 24.7382 16.8423 35.5878 39.1618 59.1695 22.6640 2.9173 1.6408 2.1606 24.4593 5.7282 5.5351 9.4434 3.2420 0.3730 9.1064 2.4552 7.3455 5.4520 11.4435 8.6748 29.6890 9.1419 0.3688 2.6294 10.3266 2.7704 30.5139 32.0116 20.2647 24.7329 23.7089 0.2020 4.2425 5.2232 19.3147 5.4721 93.4837 27.8177 30.6355 7.9748 7.8455 19.4953 18.8303 2.3073 23.5257 0.8163 568.3558 41.5465 41.3493 23.9793 18.0365 7.1022 1.1236 5.7026 29.8224 23.9236 17.7346 0.2072 24.6448 66.9888
temp: 298.150 k
press: 1.00000 atm
elementType: 8 7 7 7 6 6 6 6 6 6 6 6 6 6 6 6 6 6 1 1 1 1 1 1 1 1 1 1 1 1 1
symmnumber: 1
zpe: 638938.2 jmol-1
zpe.correction: 0.243359 hartree
zpe.thermalcorrener: 0.258329 hartree
zpe.thermalcorrenthalpy: 0.259273 hartree
zpe.thermalcorrgfe: 0.201214 hartree
zpe.sumelectzpe: -779.509897 hartree
zpe.sumelectthermal: -779.494927 hartree
zpe.sumelectthermalent: -779.493983 hartree
zpe.sumelectthermalfe: -779.552042 hartree
dipole: 1.4586 8.0867 0.7458
dipole: 8.2509
quadrupole: -101.1715 -100.3223 -102.1893
quadrupole: -17.4853 -0.6876 -5.4294
quadrupole: 0.0562 0.9054 -0.9616 -17.4853 -0.6876 -5.4294
hfenergy: -779.7532562 hartree
pointgroup: C01 [X(C14H13N3O1)]
dipole: 0.6270767 3.1665114 0.3429457 debye
polarizability: 231.2933092|6.1716647|188.3907471|1.624716|-15.4674554|109.9146099 unknown
InChI: InChI=1S/C14H13N3O/c1-9-13-11(7-15-9)17-12(18)8-16-14(13)10-5-3-2-4-6-10/h2-7,15,17H,8H2,1H3
charge 0 multiplicity 1
31 atoms
O  -3.565194 -2.476468 -0.619671
N  -1.391828 2.908519 0.170665
N  -2.812296 -0.285146 -0.765869
N  -0.448959 -1.654648 0.661816
C  -0.69898 0.761639 0.201709
C  -2.060055 0.821378 -0.311223
C  -0.319184 2.09006 0.512083
C  0.081426 -0.48842 0.326487
C  -2.462812 2.16013 -0.329618
C  1.547128 -0.49263 0.010948
C  -1.884254 -1.709613 1.033424
C  0.925481 2.660677 1.134587
C  -2.825581 -1.555252 -0.1761
C  2.102621 0.399419 -0.944781
C  2.397108 -1.444784 0.63589
C  3.477183 0.345153 -1.263777
C  3.771033 -1.49278 0.323821
C  4.317912 -0.596688 -0.626826
H  -3.398324 2.61752 -0.640722
H  -1.408637 3.91742 0.312021
H  -3.473198 -0.156754 -1.537174
H  -2.145055 -0.916305 1.770411
H  -2.091762 -2.69756 1.469939
H  1.516319 1.863653 1.610184
H  1.583108 3.147728 0.389083
H  0.678299 3.409875 1.910674
H  1.449422 1.11545 -1.455915
H  1.951533 -2.143367 1.350893
H  3.890035 1.028895 -2.014233
H  4.416621 -2.228471 0.816591
H  5.385392 -0.636831 -0.871716
