program: Gaussian 09
title: 000201657
version: EM64L-G09RevD.01
frameworkgroup: C1[X(C13H28N2O)]
method: RPBEPBE
basis: SDD
operation: Freq
keyword: #p
keyword: freq=noraman
keyword: PBEPBE/SDD
title: #p freq=noraman PBEPBE/SDD
converged: NO YES NO NO
title: Mulliken charges:
elementType: O N N C C C C C C C C C C C C C H H H H H H H H H H H H H H H H H H H H H H H H H H H H
charge: -0.254914 -0.621757 -0.073342 0.289218 -0.095715 -0.048112 -0.495117 -0.404043 0.114791 -0.766602 -0.748285 -0.739172 -0.729505 -0.364769 -0.630007 -0.616165 0.240357 0.149752 0.170724 0.221402 0.238293 0.225812 0.227010 0.212644 0.232412 0.186977 0.257890 0.206437 0.241359 0.239805 0.202592 0.208873 0.220460 0.216418 0.166876 0.210041 0.307605 0.327181 0.217907 0.244669 0.180903 0.183279 0.223895 0.221922
chargesum: 0.00000
title: Mulliken charges with hydrogens summed into heavy atoms:
elementType: O N N C C C C C C C C C C C C C
charge: -0.254914 0.013028 -0.073342 0.289218 0.144642 0.101640 -0.102990 0.060061 0.114791 -0.094536 -0.096982 -0.055416 -0.083753 0.012148 0.013472 0.012932
polarizability: 1.73858266e+02 1.47645583e+00 1.49308367e+02 3.51766422e-01 -3.05640531e-01 1.48196379e+02
1716.lowfreq: -17.0609 0.0006 0.0009 0.0009 9.0437 9.4074 22.4332 37.5216 53.2418
frequency: 20.8545 37.3304 53.1732 65.9626 101.3831 109.6197 113.0268 152.4882 167.9007 169.1181 195.7633 209.5943 219.2914 224.0314 235.6486 243.3117 266.7237 281.2120 298.1572 317.2921 323.4663 329.4650 347.9835 352.9394 369.3260 405.8465 430.0560 437.4708 455.3570 491.8179 502.3064 538.6849 586.4914 606.8897 628.7699 728.4579 744.7072 806.4569 819.5017 865.5786 891.4819 918.6053 922.9502 941.4350 955.0776 960.8278 964.8171 1003.6347 1028.4300 1034.6058 1050.8377 1059.2505 1074.5985 1084.6666 1094.0465 1119.3238 1126.9199 1132.0577 1150.3176 1156.4521 1178.2870 1188.6679 1204.0365 1230.0705 1258.8734 1272.9338 1288.3364 1298.1455 1306.4987 1312.1677 1318.2919 1332.4815 1354.1733 1370.5502 1376.6822 1380.7968 1383.6374 1395.7737 1403.9983 1419.1090 1441.8147 1458.0288 1459.5503 1461.5129 1464.5467 1470.3584 1473.3565 1475.5751 1477.4747 1479.3991 1484.2348 1486.9733 1491.7311 1492.7579 1499.7738 1502.9601 1577.1388 1624.4395 2800.1927 2836.2094 2852.9360 2912.8585 2961.0809 2976.8763 2981.3864 2986.7080 2987.9054 2990.9923 2995.7022 3000.5502 3015.4252 3027.0304 3030.9124 3057.9535 3062.0420 3065.6537 3069.4506 3073.3707 3074.8368 3088.4637 3090.2366 3096.6780 3102.5955 3106.0295 3515.0500 3670.6746
redmass: 2.5711 3.3299 5.2911 3.4584 1.8986 2.6224 2.0906 2.9004 2.2147 2.9076 1.4029 1.6068 1.9389 1.4066 1.5346 1.3574 2.5845 1.1272 1.2204 2.7975 2.1959 2.3473 2.4632 2.6700 2.8198 2.4446 2.6308 2.2861 2.6684 1.1870 2.9861 1.9056 2.5509 1.8346 2.4466 3.1518 1.3815 1.8958 3.8308 2.6948 1.8284 1.1986 1.1838 1.7260 1.9854 1.4231 1.5641 3.0777 2.3076 1.6038 1.9263 3.5296 1.9789 1.8150 1.4158 1.7283 1.7091 1.9630 1.9647 2.0324 2.0767 2.1088 2.2404 2.0771 2.0306 1.7283 1.3039 1.2440 1.8044 1.3644 1.5788 1.3094 1.3355 1.3088 1.3634 1.2079 1.2050 1.2014 1.1955 1.1447 1.1625 1.0643 1.0632 1.0644 1.0552 1.0490 1.0630 1.0525 1.0544 1.0695 1.0594 1.0617 1.0633 1.0469 1.0484 1.0544 1.9820 2.1570 1.0704 1.0577 1.0577 1.0815 1.0642 1.0374 1.0363 1.0379 1.0386 1.0747 1.0818 1.0717 1.0712 1.0920 1.0716 1.0989 1.1028 1.0983 1.0967 1.0964 1.1010 1.0999 1.1000 1.0979 1.0984 1.0982 1.0445 1.1040
irintensity: 0.3610 0.0302 9.0246 1.6872 1.1553 0.3531 0.5875 1.5619 0.2013 0.2182 0.0578 2.0190 0.6353 1.1360 3.0110 1.4672 0.4163 1.1670 0.8495 2.1563 4.1075 4.5915 0.1143 2.8207 0.7517 1.0524 2.1505 0.3202 2.8028 196.8857 4.4188 31.7477 22.8830 36.8840 6.3393 19.6283 6.1031 5.7072 15.1618 3.7654 2.3483 5.1726 4.0864 3.7476 6.3471 0.1061 4.3554 8.8453 9.6193 20.7063 0.9556 7.7484 8.2484 16.7550 7.1970 2.2450 2.7103 13.7971 5.2162 10.6459 17.5126 10.0979 7.0963 12.8093 6.8312 22.1522 2.9312 8.3646 51.0139 4.1054 21.8590 5.9260 4.0007 3.4771 12.1400 17.9383 14.6322 18.0332 32.1171 1.7355 4.1505 6.9036 4.9783 17.5218 0.6952 3.4775 7.6750 9.6392 13.8081 8.2329 4.9820 16.7129 7.6501 12.0055 14.0542 0.1546 72.6728 237.8748 76.1714 71.7262 227.9434 43.6997 46.5859 28.4019 23.6180 56.7490 30.9738 5.6447 8.8585 34.3449 46.2028 17.5034 42.0585 41.5246 50.0011 68.0453 33.3075 35.6905 38.3225 24.4396 41.3429 30.4059 25.4083 31.9342 21.3847 22.2742
temp: 298.150 k
press: 1.00000 atm
elementType: 8 7 7 6 6 6 6 6 6 6 6 6 6 6 6 6 1 1 1 1 1 1 1 1 1 1 1 1 1 1 1 1 1 1 1 1 1 1 1 1 1 1 1 1
symmnumber: 1
zpe: 1037453.8 jmol-1
zpe.correction: 0.395145 hartree
zpe.thermalcorrener: 0.415766 hartree
zpe.thermalcorrenthalpy: 0.416710 hartree
zpe.thermalcorrgfe: 0.346651 hartree
zpe.sumelectzpe: -695.553179 hartree
zpe.sumelectthermal: -695.532559 hartree
zpe.sumelectthermalent: -695.531615 hartree
zpe.sumelectthermalfe: -695.601673 hartree
dipole: 0.5609 0.1256 -4.1890
dipole: 4.2283
quadrupole: -100.7752 -100.5817 -104.3706
quadrupole: 3.6024 2.3916 -7.1113
quadrupole: 1.1340 1.3275 -2.4615 3.6024 2.3916 -7.1113
hfenergy: -695.9483247 hartree
pointgroup: C01 [X(C13H28N2O1)]
dipole: -0.2115779 -0.2423141 1.6321331 debye
polarizability: 173.7899113|-1.9891442|149.2330076|-0.1247525|0.4972107|148.3400929 unknown
InChI: InChI=1S/C13H28N2O/c1-10(2)13(11(3)4,12(14)16)8-7-9-15(5)6/h10-11H,7-9,14H2,1-6H3
charge 0 multiplicity 1
44 atoms
O  1.149303 2.16747 -1.075489
N  0.90549 2.208728 1.206916
N  -3.994331 -0.238865 -0.144291
C  1.169599 -0.041375 0.116105
C  1.349407 -0.598594 -1.354695
C  2.288271 -0.417423 1.187319
C  -0.219399 -0.506361 0.699938
C  -1.469412 -0.061989 -0.094595
C  1.0918 1.521193 0.013755
C  0.940316 -2.079986 -1.567617
C  2.749248 -0.361664 -1.976659
C  3.624056 0.366273 1.078046
C  2.598617 -1.931876 1.3016
C  -2.763977 -0.431057 0.659822
C  -4.232395 1.168977 -0.522115
C  -5.174738 -0.831484 0.516979
H  0.653664 0.014466 -1.960605
H  1.845124 -0.133009 2.169823
H  -0.314804 -0.126326 1.739366
H  -0.216914 -1.609624 0.78381
H  -1.425913 1.029675 -0.267769
H  -1.50021 -0.545012 -1.088378
H  -0.108818 -2.277584 -1.288071
H  1.039973 -2.323297 -2.642557
H  1.580998 -2.784652 -1.012115
H  3.515264 -1.033703 -1.5470
H  3.072465 0.684524 -1.853687
H  2.703947 -0.570827 -3.062139
H  3.463756 1.455252 0.996139
H  4.220987 0.044649 0.21016
H  4.231007 0.182433 1.98517
H  3.230014 -2.109004 2.192894
H  1.689122 -2.54863 1.40914
H  3.161415 -2.295864 0.424383
H  -2.804251 0.152321 1.62137
H  -2.719418 -1.502746 0.94028
H  0.861134 1.745639 2.11196
H  0.832281 3.225033 1.163192
H  -5.153204 1.234358 -1.128842
H  -3.398959 1.549295 -1.135328
H  -4.352213 1.846868 0.363297
H  -5.43241 -0.34221 1.492287
H  -4.993498 -1.903982 0.711635
H  -6.0545 -0.748714 -0.146333
