program: Gaussian 09
title: 000201640
version: EM64L-G09RevD.01
frameworkgroup: C1[X(C11H8O2)]
method: RPBEPBE
basis: SDD
operation: Freq
keyword: #pfreq=noraman
keyword: PBEPBE/SDD
title: #p freq=noraman PBEPBE/SDD
converged: YES YES YES YES
title: Mulliken charges:
elementType: O O C C C C C C C C C C C H H H H H H H H
charge: -0.250060 -0.208067 0.365763 0.225697 -0.496646 -0.365115 0.385283 -0.368893 -0.212977 -0.385948 -0.262344 -0.167046 -0.210970 0.268012 0.268751 0.255993 0.234377 0.238200 0.256613 0.262486 0.166889
chargesum: 0.00000
title: Mulliken charges with hydrogens summed into heavy atoms:
elementType: O O C C C C C C C C C C C
charge: -0.250060 -0.208067 0.365763 0.225697 -0.228634 -0.096364 0.385283 -0.112900 0.021400 -0.147748 -0.005731 0.095441 -0.044081
polarizability: 2.05471457e+02 -7.32527241e+00 1.40515659e+02 -6.96110516e-03 -1.29920246e-02 4.82470471e+01
1716.lowfreq: -8.9464 -0.0011 -0.0008 -0.0006 2.9181 6.3133 42.5793 101.2117 104.3584
frequency: 42.5776 101.2117 104.3583 126.0267 205.9216 232.4623 274.9245 338.1790 434.6449 437.4697 437.9638 536.3087 585.5358 639.4691 667.2857 669.6394 694.9928 727.6760 805.6229 821.2959 849.7225 870.1179 881.2185 895.5512 924.1922 934.2494 984.9567 996.1915 1002.0681 1007.7947 1036.1777 1070.8729 1093.4753 1136.8014 1177.7693 1188.2278 1208.5418 1285.8950 1293.7714 1355.8707 1377.2659 1400.6902 1443.9723 1453.6785 1488.3610 1569.3448 1593.2902 1600.6895 1629.9068 2872.2490 3125.3901 3148.2750 3150.0218 3171.6386 3220.1352 3234.9774 3269.4281
redmass: 4.7060 4.2554 6.3010 4.9861 6.4406 2.8149 3.8485 6.8417 4.8367 6.9607 2.7922 4.5860 2.9825 6.7109 4.3378 6.6976 1.9450 1.2765 1.3458 1.4654 5.9646 6.5282 1.3808 4.2696 1.3512 1.4901 6.1155 1.6087 1.5426 1.6592 2.4158 2.3433 1.7360 1.6093 1.5955 1.6123 1.5551 2.6845 1.3509 2.6866 1.6132 4.1204 2.9495 2.8414 4.1696 6.2421 6.3959 6.8990 6.5322 1.0850 1.0883 1.0916 1.0916 1.0976 1.0925 1.0985 1.1082
irintensity: 2.0816 5.6403 4.5131 3.3141 2.3094 3.0219 6.1643 1.9274 6.4426 0.5131 3.7330 0.5748 8.8707 21.4967 0.0481 26.8115 17.8305 89.8335 86.0078 0.3867 9.6947 5.2740 0.0989 9.2744 1.7726 9.0489 2.9170 5.2350 7.3977 28.7655 0.9954 7.9022 8.6600 5.2582 66.4755 38.6174 5.4413 6.6750 5.9096 5.0985 0.6812 6.7030 30.9003 2.9078 41.5386 25.9909 27.4771 138.0871 77.2450 140.2810 3.1091 6.3028 12.5193 10.0831 5.5236 0.2769 0.0310
temp: 298.150 k
press: 1.00000 atm
elementType: 8 8 6 6 6 6 6 6 6 6 6 6 6 1 1 1 1 1 1 1 1
symmnumber: 1
zpe: 411673.0 jmol-1
zpe.correction: 0.156798 hartree
zpe.thermalcorrener: 0.167187 hartree
zpe.thermalcorrenthalpy: 0.168131 hartree
zpe.thermalcorrgfe: 0.119737 hartree
zpe.sumelectzpe: -573.493490 hartree
zpe.sumelectthermal: -573.483100 hartree
zpe.sumelectthermalent: -573.482156 hartree
zpe.sumelectthermalfe: -573.530551 hartree
dipole: 1.9306 2.5404 0.0000
dipole: 3.1908
quadrupole: -64.5075 -74.0275 -79.3685
quadrupole: -13.7792 0.0005 -0.0011
quadrupole: 8.1269 -1.3930 -6.7340 -13.7792 0.0005 -0.0011
hfenergy: -573.6502876 hartree
pointgroup: C01 [X(C11H8O2)]
dipole: 0.7471104 -1.0088313 -0.000011 debye
dipolederiv: -0.2134834 -0.0730958 0.000008 -0.0419332 -0.5982386 0.0001709 -0.0000753 0.0001362 -0.1284856 -0.5304592 0.0667019 -0.0000123 0.5524774 -1.0164367 0.0000738 -0.0000479 0.0000492 -0.3305806 0.6983526 0.2954069 -0.0000305 0.3338154 -0.1104027 0.000043 -0.0000479 0.0000255 0.0624628 -0.0207599 -0.0885133 0.0000455 -0.2268849 0.2246304 -0.0001322 0.0001199 -0.0000558 0.0068149 -0.1769951 -0.2383703 0.0000227 0.125428 0.0284929 0.0000033 -0.000012 -0.0000259 -0.1231059 -0.0881706 -0.0528394 0.0000073 -0.1904317 -0.0072947 -0.0000048 0.0000449 -0.0000123 -0.135107 -0.52062 0.4113702 -0.0000492 0.3483357 -0.2834201 0.0000365 -0.0000663 0.0000422 0.0343698 0.1278215 -0.0231093 0.0000479 -0.0439586 -0.0772828 -0.0000473 0.0000782 -0.0000372 -0.1833664 -0.1560385 0.0616178 -0.0000061 0.1051691 0.2138652 -0.0000261 0.0000011 -0.0000242 -0.1406745 -0.0655627 0.0285591 0.0000068 -0.2392489 0.0161982 -0.0000262 0.0000249 -0.0000126 -0.1731975 -0.1398099 0.0421002 -0.0000038 0.2221517 -0.0234832 -0.0000337 -0.0000964 -0.0000663 -0.2047856 -0.1865917 0.0148259 -0.0000124 -0.0704946 0.286853 -0.0001524 0.000048 -0.000149 -0.1363249 1.2598613 -0.3680381 0.0000643 -0.6355109 1.1889627 -0.0001069 0.0000861 -0.0000965 0.1038456 0.109843 -0.0328547 -0.0000003 -0.0674655 -0.0037067 0.0000042 0.0000019 0.0000081 0.1463341 0.0343049 0.0828594 -0.0000086 0.0716035 0.0570273 0.0000066 -0.0000013 0.0000162 0.1578641 0.0749724 0.0902683 -0.0000451 0.0869927 0.0496404 0.0000637 -0.000036 0.0000643 0.193168 0.0718055 -0.0327838 -0.0000004 -0.0454904 -0.1174498 0.0000204 -0.0000009 0.0000207 0.1576073 -0.0860399 -0.0730175 -0.0000048 -0.0298466 0.0863977 0.0000039 -0.0000097 0.0000049 0.1630717 0.0155731 -0.0790422 0.0000079 -0.09393 0.0580391 0.0000393 0.0000066 0.0000392 0.2004323 0.0392746 0.0296669 -0.0000311 0.0451465 0.0646827 0.0000594 -0.0000279 0.0000626 0.2233667 -0.2472781 -0.0617122 -0.0000059 -0.2059249 -0.0370742 0.0000043 0.00001 0.0000108 0.1062906 unknown
polarizability: 205.6432791|6.5168439|140.3438371|0.0067993|-0.0130774|48.2470471 unknown
InChI: InChI=1S/C11H8O2/c12-8-9-3-1-4-10(7-9)11-5-2-6-13-11/h1-8H
charge 0 multiplicity 1
21 atoms
O  2.589188 -0.842139 0.000586
O  -3.271057 2.274916 -0.00019
C  0.178844 -0.36283 0.000142
C  1.5551 0.12844 0.000142
C  -0.909663 0.544309 0.000036
C  -0.096403 -1.76377 0.000244
C  -2.242629 0.066843 0.00001
C  2.133444 1.3956 -0.000232
C  -1.423918 -2.238364 0.000232
C  -2.503615 -1.329249 0.00011
C  3.566676 1.221766 -0.000012
C  3.806838 -0.14226 0.000468
C  -3.382128 1.019397 -0.000109
H  -0.753452 1.628751 -0.000015
H  0.741901 -2.467168 0.000335
H  1.601067 2.34461 -0.000641
H  -1.612383 -3.317021 0.000313
H  -3.539467 -1.690417 0.000093
H  4.318727 2.007946 -0.000199
H  4.702649 -0.756542 0.000778
H  -4.39312 0.537078 -0.00009
