program: Gaussian 09
title: 000201664
version: EM64L-G09RevD.01
frameworkgroup: C1[X(C15H21N3O2)]
method: RPBEPBE
basis: SDD
operation: Freq
keyword: #p
keyword: freq=noraman
keyword: PBEPBE/SDD
title: #p freq=noraman PBEPBE/SDD
converged: YES YES NO NO
title: Mulliken charges:
elementType: O O N N N C C C C C C C C C C C C C C C H H H H H H H H H H H H H H H H H H H H H
charge: -0.287943 -0.277059 -0.404393 -0.417490 -0.169594 -0.158740 -0.461365 -0.561396 0.264827 0.284161 -0.419814 -0.419249 -0.229056 -0.229356 0.234186 -0.147647 0.172821 -0.704789 -0.631690 -0.610600 0.273144 0.233851 0.219960 0.229768 0.226028 0.364335 0.248565 0.239121 0.224261 0.224036 0.246813 0.388035 0.229668 0.261852 0.215698 0.240921 0.214045 0.232490 0.230452 0.202308 0.228837
chargesum: 0.00000
title: Mulliken charges with hydrogens summed into heavy atoms:
elementType: O O N N N C C C C C C C C C C C C C C C
charge: -0.287943 -0.277059 -0.040059 -0.029455 -0.169594 0.114404 -0.007554 -0.105600 0.264827 0.284161 -0.171250 -0.180129 -0.004794 -0.005320 0.234186 0.099167 0.172821 0.002429 0.055765 0.050997
polarizability: 2.40004845e+02 -7.96799264e+00 1.81275842e+02 1.28459904e+01 3.13469183e+00 1.41236316e+02
1716.lowfreq: -9.3965 -2.8463 -0.0009 -0.0006 0.0005 4.6506 10.2744 28.0334 44.0594
frequency: 8.5609 28.0208 44.0367 53.4396 77.3012 92.0991 101.9864 133.2004 155.0021 171.1915 186.6549 208.6377 218.4007 226.2400 254.4231 262.6084 276.5835 288.1822 311.9032 366.4142 374.5311 409.5005 443.2454 454.3047 468.9240 493.8336 514.2544 536.6932 550.6688 595.4417 601.8739 668.2222 713.2227 721.7108 734.6312 755.6159 772.1060 774.3606 805.6922 835.9909 860.3176 885.7012 898.4206 910.9760 925.1857 944.9881 954.4444 967.2608 987.2386 1000.6165 1021.8515 1037.9861 1038.7381 1047.6324 1076.7288 1085.6934 1090.0139 1098.6489 1133.8054 1141.8405 1150.1041 1162.2743 1168.2870 1169.4165 1188.8768 1190.2897 1225.0268 1231.1689 1261.2247 1264.1012 1279.1030 1279.9781 1284.3484 1306.3509 1337.7452 1340.0372 1380.8162 1390.3735 1422.4171 1427.1537 1446.3267 1449.0459 1459.7982 1461.8438 1464.0512 1471.4151 1473.1822 1477.0225 1478.9571 1487.9325 1497.9368 1524.6396 1597.9619 1602.9689 1618.0226 1655.8274 2901.4015 2920.8377 2977.9929 2978.4843 2997.5205 2998.6239 3008.6552 3029.6464 3035.2645 3047.5908 3083.0052 3085.7795 3087.2857 3093.3748 3109.3387 3118.4613 3127.3238 3140.0139 3158.8643 3339.0769 3347.1026
redmass: 3.9752 4.5478 4.4186 4.9836 4.1643 3.7219 4.4244 3.8349 3.0824 2.3700 1.3817 3.8924 1.1553 4.0482 1.3778 2.4667 1.7618 3.7687 3.7777 3.0980 6.5389 3.2122 3.4978 3.5926 3.5167 3.4160 3.6347 5.1813 3.9255 4.3760 3.8631 4.1549 6.8760 3.5594 2.8223 1.6285 2.9740 1.9943 1.1848 3.6767 1.6581 1.5422 3.6509 1.1510 2.6768 1.4519 2.2282 2.5140 1.3179 2.9846 2.1442 2.0181 1.4745 2.1367 2.6841 2.0519 1.5261 1.8213 2.2343 1.4962 1.7483 1.6316 1.3717 1.3604 1.6561 2.4707 2.2547 1.8502 1.2995 2.3104 1.6733 1.5231 1.3317 1.4716 1.4344 1.4064 1.2014 7.0110 1.2926 1.8413 2.3836 1.2393 1.2813 1.0489 1.0599 1.0545 1.3013 1.5753 1.0716 1.0548 1.0556 1.9377 7.0187 5.6754 7.1514 6.7246 1.0515 1.0488 1.0650 1.0822 1.0361 1.0803 1.0665 1.0791 1.0825 1.0958 1.1015 1.1029 1.1011 1.1006 1.0990 1.0855 1.0890 1.0946 1.1003 1.0817 1.0767
irintensity: 0.0066 1.3628 1.0087 0.6302 0.8092 1.9657 3.2729 2.8816 0.5310 3.3397 1.0038 7.7692 0.4232 3.5084 0.4235 7.0258 0.5107 9.0107 1.2097 6.2098 14.9302 3.5742 24.3503 11.1585 4.8940 1.6335 9.8339 38.0797 14.7015 4.0539 1.9653 1.1301 2.1187 6.3579 7.6391 41.4718 3.7358 33.2726 109.1612 3.6627 1.3645 1.0931 27.4470 63.8723 10.3824 1.2743 5.4664 6.7398 0.0972 3.3246 6.8928 19.1379 8.8923 2.5440 2.9893 3.7072 9.0310 55.3178 4.3678 1.6942 6.0321 5.3581 6.9064 18.9171 17.0419 28.7536 140.3836 27.7085 4.8516 8.5157 1.0971 6.0469 21.6096 5.2725 8.3532 9.9287 30.5553 2.5585 96.0913 268.5978 9.7890 61.4243 9.6469 8.2902 14.5711 10.4126 3.1701 20.5804 49.6886 6.7763 3.8789 630.5917 6.1934 21.7466 3.5705 430.5529 101.3582 102.5652 38.1031 10.2064 24.9656 1.6491 35.3557 33.5583 33.8623 30.8747 7.4600 30.7868 45.8509 33.7845 12.2082 3.6571 4.5215 35.4926 32.6610 158.7893 261.4541
temp: 298.150 k
press: 1.00000 atm
elementType: 8 8 7 7 7 6 6 6 6 6 6 6 6 6 6 6 6 6 6 6 1 1 1 1 1 1 1 1 1 1 1 1 1 1 1 1 1 1 1 1 1
symmnumber: 1
zpe: 897255.9 jmol-1
zpe.correction: 0.341747 hartree
zpe.thermalcorrener: 0.361514 hartree
zpe.thermalcorrenthalpy: 0.362458 hartree
zpe.thermalcorrgfe: 0.291284 hartree
zpe.sumelectzpe: -897.430631 hartree
zpe.sumelectthermal: -897.410864 hartree
zpe.sumelectthermalent: -897.409920 hartree
zpe.sumelectthermalfe: -897.481094 hartree
dipole: 3.2726 1.2817 -1.1069
dipole: 3.6848
quadrupole: -86.7152 -122.5194 -123.9175
quadrupole: 2.8490 3.2832 10.7696
quadrupole: 24.3355 -11.4687 -12.8668 2.8490 3.2832 10.7696
hfenergy: -897.7723782 hartree
pointgroup: C01 [X(C15H21N3O2)]
dipole: 1.3883835 -0.2308246 -0.3474979 debye
polarizability: 226.48231|36.7005243|157.2043873|0.0335642|10.1496132|178.8303052 unknown
InChI: InChI=1S/C15H21N3O2/c1-10(18(2)3)14(19)17-15(20)16-13-9-8-11-6-4-5-7-12(11)13/h4-7,10,13,16-17H,8-9H2,1-3H3
charge 0 multiplicity 1
41 atoms
O  0.000108 2.235752 1.284212
O  1.750049 -1.130364 -0.664285
N  -0.460152 0.114529 0.376063
N  1.738252 0.994844 0.342648
N  4.254881 1.542762 -0.303257
C  -1.888249 0.120759 0.710704
C  -2.267985 -0.80104 1.919468
C  -3.743338 -1.226472 1.652546
C  -2.786275 -0.404671 -0.408977
C  -3.847996 -1.172393 0.132036
C  -2.678137 -0.193275 -1.796805
C  -4.817109 -1.740968 -0.71809
C  -3.648576 -0.769794 -2.653158
C  -4.710703 -1.537816 -2.116791
C  0.359322 1.167239 0.707062
C  3.887497 0.10107 -0.427573
C  2.351043 -0.073948 -0.283912
C  4.413458 -0.651036 -1.673476
C  4.049258 2.340603 -1.537035
C  5.588928 1.771976 0.295362
H  -2.141685 1.172154 0.949802
H  -2.125167 -0.291632 2.887142
H  -1.6122 -1.692023 1.899295
H  -4.445873 -0.500859 2.110215
H  -3.98652 -2.219809 2.070429
H  -0.024547 -0.702832 -0.083708
H  -1.851618 0.398457 -2.206881
H  -5.639609 -2.339486 -0.308715
H  -3.576425 -0.624747 -3.737061
H  -5.452421 -1.982572 -2.790256
H  4.308762 -0.399723 0.469343
H  2.391181 1.766348 0.56775
H  4.036754 -0.203246 -2.608911
H  4.06492 -1.696269 -1.643045
H  5.517746 -0.642994 -1.69574
H  3.030151 2.176539 -1.928923
H  4.777417 2.101326 -2.344734
H  4.150088 3.412611 -1.291739
H  5.717702 2.850789 0.494218
H  6.431396 1.442733 -0.357717
H  5.664771 1.236979 1.258197
