program: Gaussian 09
title: 000201637
version: EM64L-G09RevD.01
frameworkgroup: C1[X(C14H8N4O3)]
method: RPBEPBE
basis: SDD
operation: Freq
keyword: #p
keyword: freq=noraman
keyword: PBEPBE/SDD
title: #p freq=noraman PBEPBE/SDD
converged: YES YES NO NO
title: Mulliken charges:
elementType: O O O N N N N C C C C C C C C C C C C C C H H H H H H H H
charge: -0.217485 -0.213242 -0.181384 -0.459251 -0.067135 0.048661 -0.002326 0.285730 0.012082 0.085614 0.281751 -0.362900 -0.335969 -0.402588 0.401245 -0.206445 -0.225445 -0.353690 0.277244 -0.305753 -0.241789 0.348339 0.244811 0.254316 0.296264 0.231763 0.232609 0.276602 0.298371
chargesum: 0.00000
title: Mulliken charges with hydrogens summed into heavy atoms:
elementType: O O O N N N N C C C C C C C C C C C C C C
charge: -0.217485 -0.213242 -0.181384 -0.110912 -0.067135 0.048661 -0.002326 0.285730 0.012082 0.085614 0.281751 -0.118089 -0.081653 -0.106323 0.401245 0.025318 0.007164 -0.077088 0.277244 -0.007382 -0.241789
polarizability: 5.67127382e+02 -1.54510340e+01 2.08061830e+02 3.05237668e-02 5.24321572e-04 7.05901366e+01
1716.lowfreq: -8.1671 -0.0009 0.0003 0.0007 0.3365 4.0297 25.0593 39.9175 43.5179
frequency: 25.0560 39.9005 43.5175 57.7467 77.7337 97.1156 119.9432 129.4027 177.8575 207.4979 248.3290 256.0810 256.6655 347.8341 349.1799 364.7037 410.8046 440.8593 444.2715 501.9608 516.4254 561.6605 571.0767 583.5671 610.5105 612.7090 648.2849 666.4634 679.7362 709.7113 720.6604 735.6524 758.9603 761.7219 770.0807 801.2110 810.8975 861.7564 884.7555 904.6476 906.0809 918.6380 924.1849 939.4742 944.6695 983.2556 1003.3408 1026.5793 1057.5138 1116.6006 1128.9764 1161.6330 1186.9039 1216.4629 1224.6793 1234.5740 1265.9785 1292.3254 1303.2799 1317.0565 1338.7707 1349.5023 1374.9177 1412.7783 1426.0141 1466.9416 1480.4197 1509.9905 1532.4816 1587.7744 1618.0899 1629.4238 2165.8962 3137.5165 3138.9476 3150.2819 3164.0643 3176.7621 3229.7385 3260.9096 3570.5489
redmass: 8.7735 6.3567 8.3424 8.5939 7.4182 9.6288 6.7831 11.5717 7.1124 10.6309 6.2351 4.9464 6.4897 6.8908 6.2558 4.5642 9.7560 3.1424 8.7099 6.5428 7.1480 5.6467 3.5214 8.7266 7.3862 6.5913 1.1487 4.7065 7.9276 7.8672 6.5666 9.1794 1.4482 7.5463 3.2231 4.9100 1.3182 1.4997 6.2826 8.7247 1.3628 7.3526 6.1170 1.3811 1.3766 1.3152 2.1392 1.3193 3.2551 1.5643 4.5080 1.1502 1.8853 4.4626 2.6704 1.7998 2.8583 6.7445 2.1247 2.6963 3.8743 6.6131 3.5049 2.9259 3.2419 7.3210 3.6810 5.3155 6.0165 6.8676 7.8738 7.3547 12.6286 1.0859 1.0896 1.0904 1.0962 1.0995 1.0964 1.1030 1.0818
irintensity: 1.0646 4.3841 1.9276 5.0717 0.0988 1.1892 0.0511 4.0033 0.5127 1.1949 7.9789 2.8673 0.8445 3.6131 0.1164 3.6022 2.3279 9.3987 0.2051 11.4954 8.7610 1.4296 2.1203 3.0927 0.0606 4.0468 80.9121 1.0218 12.1871 21.0532 1.0275 1.7750 116.3640 6.4965 14.4053 5.2008 58.2741 0.0000 1.0573 14.2399 8.6583 14.1473 5.7703 24.1745 2.8663 0.0037 1.5566 26.5368 21.4507 6.5423 121.3570 25.0874 6.9198 397.8925 118.7107 294.0650 9.3209 78.6068 18.5775 1.9752 16.7374 143.6361 7.9007 25.4229 111.6420 112.1766 33.4674 39.5938 11.6298 24.6943 80.3273 13.2943 18.5106 0.7511 2.8964 6.4177 21.1390 35.8533 0.7730 6.9604 55.2615
temp: 298.150 k
press: 1.00000 atm
elementType: 8 8 8 7 7 7 7 6 6 6 6 6 6 6 6 6 6 6 6 6 6 1 1 1 1 1 1 1 1
symmnumber: 1
zpe: 518227.8 jmol-1
zpe.correction: 0.197383 hartree
zpe.thermalcorrener: 0.214210 hartree
zpe.thermalcorrenthalpy: 0.215154 hartree
zpe.thermalcorrgfe: 0.150515 hartree
zpe.sumelectzpe: -981.410756 hartree
zpe.sumelectthermal: -981.393928 hartree
zpe.sumelectthermalent: -981.392984 hartree
zpe.sumelectthermalfe: -981.457623 hartree
dipole: -6.2273 -4.2667 0.0067
dipole: 7.5487
quadrupole: -128.1593 -115.0333 -122.2198
quadrupole: -27.5629 0.0044 0.0129
quadrupole: -6.3552 6.7708 -0.4157 -27.5629 0.0044 0.0129
hfenergy: -981.6081383 hartree
pointgroup: C01 [X(C14H8N4O3)]
dipole: -2.4655743 -1.6542629 -0.0685681 debye
polarizability: 566.6434015|-19.0192278|208.362559|8.4819003|1.9635354|70.7733887 unknown
InChI: InChI=1S/C14H8N4O3/c15-8-9(7-10-5-6-13(21-10)18(19)20)14-16-11-3-1-2-4-12(11)17-14/h1-7,16H
charge 0 multiplicity 1
29 atoms
O  2.958552 0.0649 0.094481
O  6.541753 0.050327 0.159113
O  5.051068 1.807558 0.157552
N  -2.356986 1.222505 0.02196
N  -2.206563 -1.061402 -0.015884
N  5.340199 0.54954 0.144215
N  0.819434 2.687254 0.101798
C  -3.674689 0.75715 -0.010001
C  -3.557509 -0.681702 -0.033559
C  -1.512369 0.100479 0.016204
C  -0.052963 0.204457 0.043771
C  -4.922176 1.415007 -0.020466
C  -4.723492 -1.485514 -0.068586
C  0.712865 -0.952619 0.038035
C  2.133024 -1.08604 0.061336
C  -6.067238 0.59332 -0.055422
C  -5.969924 -0.832976 -0.079104
C  2.950391 -2.235118 0.05821
C  4.271134 -0.409594 0.110482
C  4.309727 -1.803137 0.088916
C  0.480861 1.539556 0.076103
H  -2.047651 2.19486 0.044943
H  -5.007945 2.505944 -0.002553
H  -4.641973 -2.576087 -0.08634
H  0.146493 -1.891537 0.012351
H  -7.058758 1.058589 -0.064756
H  -6.890119 -1.426031 -0.1059
H  2.590206 -3.261785 0.035729
H  5.211647 -2.408904 0.095476
