program: Gaussian 09
title: 000201619
version: EM64L-G09RevD.01
frameworkgroup: C1[X(C14H16N2)]
method: RPBEPBE
basis: SDD
operation: Freq
keyword: #pfreq=noraman
keyword: PBEPBE/SDD
title: #p freq=noraman PBEPBE/SDD
converged: YES YES NO NO
title: Mulliken charges:
elementType: N N C C C C C C C C C C C C C C H H H H H H H H H H H H H H H H
charge: -0.295924 -0.003703 -0.366282 -0.572413 0.493105 -0.473089 0.422126 -0.412974 -0.409041 -0.355861 -0.227148 -0.227865 -0.468364 -0.242945 -0.181909 -0.339404 0.198114 0.225273 0.198687 0.230696 0.252351 0.194713 0.228267 0.229815 0.234748 0.242717 0.223910 0.224498 0.280779 0.227733 0.229325 0.240066
chargesum: 0.00000
title: Mulliken charges with hydrogens summed into heavy atoms:
elementType: N N C C C C C C C C C C C C C C
charge: -0.043573 -0.003703 0.057106 -0.143031 0.493105 -0.050109 0.422126 -0.183160 -0.174293 -0.113143 -0.003238 -0.003367 -0.187584 -0.015213 0.047416 -0.099338
polarizability: 2.31267770e+02 -4.47983822e+00 1.41252786e+02 -1.69583801e+01 -4.49604264e+00 1.02717649e+02
1716.lowfreq: -9.6844 -5.0092 -0.0008 -0.0006 -0.0005 8.5561 17.3007 24.5658 30.0924
frequency: 15.4390 23.8981 29.6804 41.3527 80.6952 108.0016 128.7859 202.0156 208.1525 263.4980 335.7783 346.2001 392.0054 403.4536 404.5125 472.4687 508.2710 582.4119 605.0154 617.9453 625.7497 674.4204 705.4360 724.2889 759.6249 791.0982 800.5774 815.2438 817.7637 854.0037 917.6119 931.4471 934.1306 972.5825 975.7864 986.3323 990.0843 993.8715 1003.1405 1005.7347 1025.0640 1026.9606 1036.4137 1070.0254 1100.7139 1111.4051 1143.5579 1163.0482 1172.2148 1187.5724 1191.5639 1214.9453 1218.5709 1232.4014 1273.2957 1280.9462 1304.9751 1319.5848 1327.1943 1339.7082 1378.8606 1382.6116 1416.9235 1440.1942 1452.5742 1455.3537 1474.1770 1480.7826 1484.7198 1495.6252 1558.8136 1587.7267 1593.3246 1615.0288 2852.0291 2867.0278 2973.6474 2981.3786 3004.8184 3052.8598 3113.3704 3116.4175 3120.7889 3130.8628 3131.3571 3143.0932 3147.9549 3161.7333 3162.3709 3436.6842
redmass: 3.9584 4.4580 3.5253 4.3411 4.4082 2.7885 2.2611 3.8831 4.8816 3.2498 3.1150 2.8231 2.8728 2.8228 3.8695 3.9827 3.1238 5.2169 5.5225 6.3555 5.7032 1.3182 1.7402 2.0685 1.9573 1.6770 1.2672 3.6645 2.9270 1.2463 1.4467 1.3628 1.3475 1.8506 1.3965 1.4206 6.1206 1.3160 2.4913 2.6468 2.7975 2.4876 2.6707 2.2554 1.5735 1.6276 4.1137 1.1254 1.0513 1.1197 1.3791 1.8832 2.2642 1.3926 1.2612 1.3275 3.5925 1.5279 1.2547 1.3510 1.5115 7.3736 1.9950 2.1615 1.9919 1.2935 1.1136 1.1486 2.0641 1.0867 5.5271 5.8408 6.0502 6.1780 1.0716 1.0708 1.0853 1.0639 1.0852 1.1009 1.0871 1.0867 1.0885 1.0908 1.0909 1.0959 1.0919 1.1015 1.0999 1.0745
irintensity: 1.0788 0.4824 0.0909 0.3185 0.8887 1.1894 2.9501 2.4586 0.3753 0.5522 1.1936 0.8754 4.5450 0.0122 0.9972 3.0762 19.4055 3.8172 3.2094 0.0655 6.8162 79.5560 49.1840 35.0624 54.8939 20.6199 1.9649 5.3972 16.5131 0.0311 3.0450 1.0116 7.0779 12.9020 0.1816 0.4867 0.0049 0.1608 6.9346 7.1542 2.9487 2.8438 3.2658 12.7235 6.9070 14.7930 76.4173 6.9852 0.3059 0.1277 1.8293 0.3073 2.7698 9.3144 1.9885 3.4218 3.8141 6.5035 0.1516 15.0773 3.9157 0.3794 36.1571 7.3709 50.0537 24.3552 10.2945 1.0406 15.2418 6.6804 8.5606 0.3186 1.4042 9.6016 67.4507 126.7813 21.5486 24.0935 31.7936 25.7891 10.2345 6.6572 5.0614 23.7690 11.3611 45.7773 12.5857 26.9373 26.0543 0.2156
temp: 298.150 k
press: 1.00000 atm
elementType: 7 7 6 6 6 6 6 6 6 6 6 6 6 6 6 6 1 1 1 1 1 1 1 1 1 1 1 1 1 1 1 1
symmnumber: 1
zpe: 699826.1 jmol-1
zpe.correction: 0.266550 hartree
zpe.thermalcorrener: 0.281088 hartree
zpe.thermalcorrenthalpy: 0.282033 hartree
zpe.thermalcorrgfe: 0.221047 hartree
zpe.sumelectzpe: -651.414297 hartree
zpe.sumelectthermal: -651.399758 hartree
zpe.sumelectthermalent: -651.398814 hartree
zpe.sumelectthermalfe: -651.459800 hartree
dipole: 0.9823 -3.2881 -0.8525
dipole: 3.5360
quadrupole: -92.3962 -94.9450 -95.9238
quadrupole: 12.1206 1.3541 -4.3761
quadrupole: 2.0254 -0.5233 -1.5021 12.1206 1.3541 -4.3761
hfenergy: -651.6808462 hartree
pointgroup: C01 [X(C14H16N2)]
dipole: -0.4063266 -1.1153553 0.7254154 debye
polarizability: 230.9049178|-3.1435018|140.2588462|-18.6256205|-7.3851666|104.0744405 unknown
InChI: InChI=1S/C14H16N2/c1-2-5-13(6-3-1)8-10-16-12-14-7-4-9-15-11-14/h1-7,9,11,16H,8,10,12H2
charge 0 multiplicity 1
32 atoms
N  0.689612 -0.205318 -0.185024
N  4.690529 1.071837 -0.971541
C  -0.717039 -0.24455 0.261711
C  -1.671497 0.102978 -0.908847
C  -3.127299 0.126711 -0.468537
C  1.688654 -0.459681 0.872577
C  3.11237 -0.251426 0.374289
C  -3.930605 -1.04089 -0.535408
C  -3.70197 1.311721 0.06034
C  4.174052 -1.087227 0.797504
C  -5.270504 -1.027978 -0.085305
C  -5.040759 1.330423 0.511851
C  3.429742 0.809617 -0.515656
C  -5.830425 0.158962 0.441372
C  5.486457 -0.832004 0.33961
C  5.698062 0.255376 -0.538068
H  -1.016346 -1.232546 0.693447
H  -0.84409 0.503825 1.06879
H  -1.530689 -0.64301 -1.716964
H  -1.36398 1.084318 -1.314673
H  0.850301 -0.797864 -1.011474
H  1.607408 -1.479703 1.327089
H  1.481558 0.255689 1.695792
H  -3.505178 -1.963813 -0.94999
H  -3.097257 2.226071 0.110726
H  3.976483 -1.926423 1.475761
H  -5.877242 -1.938604 -0.148937
H  -5.469276 2.256407 0.912262
H  2.631178 1.464571 -0.87942
H  -6.8700 0.172596 0.787665
H  6.326674 -1.461471 0.650052
H  6.699877 0.489408 -0.916492
