program: Gaussian 09
title: 000201620
version: EM64L-G09RevD.01
frameworkgroup: C1[X(C19H24N2O2)]
method: RPBEPBE
basis: SDD
operation: Freq
keyword: #p
keyword: freq=noraman
keyword: PBEPBE/SDD
title: #p freq=noraman PBEPBE/SDD
converged: YES YES NO NO
title: Mulliken charges:
elementType: O O N N C C C C C C C C C C C C C C C C C C C H H H H H H H H H H H H H H H H H H H H H H H H
charge: -0.262552 -0.273101 -0.111047 -0.478749 -0.403155 -0.328809 -0.324989 -0.298144 -0.669614 -0.670655 0.364647 -0.350391 -0.398317 0.251601 -0.353720 -0.319313 0.131992 0.492664 -0.348103 -0.452693 -0.214338 -0.198687 -0.256848 0.224007 0.218325 0.193351 0.206154 0.206564 0.190847 0.211280 0.229543 0.209419 0.225767 0.209790 0.210016 0.227590 0.209478 0.255445 0.252509 0.273394 0.209213 0.305675 0.310048 0.215951 0.225627 0.224578 0.227749
chargesum: 0.00000
title: Mulliken charges with hydrogens summed into heavy atoms:
elementType: O O N N C C C C C C C C C C C C C C C C C C C
charge: -0.262552 -0.273101 -0.111047 -0.173074 0.039177 0.070697 0.072422 0.142679 -0.024637 -0.023571 0.364647 -0.094947 -0.145808 0.251601 -0.080327 -0.110099 0.131992 0.492664 -0.038055 -0.236742 0.011289 0.025892 -0.029099
polarizability: 4.12165116e+02 3.34005611e-01 2.03920032e+02 -4.10757469e+00 1.94523269e+01 1.41651266e+02
1716.lowfreq: -0.9612 -0.0011 0.0005 0.0016 3.1350 8.9269 16.3577 23.0240 30.6172
frequency: 15.7685 22.5099 30.5498 37.8673 42.6203 59.9970 66.3523 85.7641 91.4299 100.7549 123.4708 149.2755 155.7495 177.5066 211.5420 224.8548 244.9490 255.3674 289.7715 299.2787 312.6645 325.5889 344.5880 376.6498 407.9349 413.1534 424.1317 452.3976 483.7491 497.3622 515.5570 520.0072 566.4811 614.7549 626.6045 636.3829 637.4582 681.6870 696.7711 740.4307 753.1445 769.3318 789.0794 796.1181 799.6372 812.1973 817.8621 826.6258 842.8972 846.8013 865.3613 916.0090 917.4553 949.9321 963.9512 971.9085 980.0075 983.8890 990.7488 999.7275 1001.1711 1024.9974 1063.5535 1064.3662 1076.3310 1080.2790 1085.6065 1094.5376 1096.7556 1122.1345 1123.3665 1162.9024 1171.4734 1177.1594 1187.4335 1208.0382 1234.1899 1237.5415 1249.1874 1259.8758 1280.8413 1288.5619 1292.0213 1306.4214 1320.1050 1329.4282 1361.4011 1366.4564 1371.1008 1384.5355 1388.1222 1389.7266 1391.3622 1423.3588 1429.4257 1462.0171 1464.2152 1470.2250 1471.5873 1480.9127 1484.3691 1485.9174 1487.3375 1492.3251 1496.1577 1514.9452 1564.5512 1596.2789 1606.4020 1613.9001 1622.4657 2857.9835 2866.3532 2919.6170 2973.5906 2982.4079 2985.7700 3016.7515 3037.5579 3038.9243 3064.7240 3075.5454 3078.6806 3091.6829 3092.2263 3105.2744 3114.6062 3130.6754 3142.7630 3150.7680 3164.1734 3165.8381 3170.7963 3196.3425 3535.5679
redmass: 5.3562 3.6499 4.4567 4.2683 3.4609 3.8579 3.8140 3.8648 2.4098 2.9791 3.9108 3.8285 3.2196 1.6937 2.5997 1.6209 3.8741 1.8731 2.0736 3.4469 3.8810 4.2407 6.3784 3.2153 2.9347 2.9544 4.0840 3.0163 2.9510 3.1166 3.2934 3.1594 6.1683 6.4449 3.7352 2.7086 2.1209 3.9002 2.0016 3.1527 4.1979 1.7450 1.5643 1.1326 1.6303 1.6785 1.9203 2.1976 1.2746 1.7247 5.9932 1.8751 1.4318 1.4022 7.0557 1.3493 1.3679 6.0830 2.2387 2.8660 1.3084 2.2303 2.3685 1.8188 1.9468 2.0981 2.1277 2.5688 2.3086 1.4002 1.6065 1.4031 1.0523 1.2679 1.1148 2.2656 2.5876 1.7717 3.6217 1.9319 1.1237 1.2276 1.2179 1.3045 1.5184 1.3345 1.3624 1.6535 2.7029 5.6486 1.2436 1.3483 1.3401 3.2619 2.9554 1.0624 1.0580 1.0922 1.0643 1.0660 2.2073 1.1053 1.0775 1.0967 2.1559 2.3350 6.7694 7.8903 3.9308 5.9858 6.5647 1.0717 1.0713 1.0699 1.0562 1.0358 1.0358 1.0881 1.0903 1.0976 1.0982 1.0982 1.0982 1.1004 1.1004 1.0886 1.0891 1.0866 1.0933 1.0879 1.0999 1.0945 1.0961 1.0950 1.0756
irintensity: 0.5488 0.4202 0.0984 0.0839 0.1399 0.4718 0.3304 3.3227 1.5841 0.6648 0.8582 2.3812 3.4241 2.8239 7.1259 2.0276 3.7772 0.0707 0.6862 0.5108 1.6985 0.6040 3.4861 1.5585 0.0290 0.5897 4.7391 3.9873 2.7210 5.5461 20.6374 38.3358 33.8018 2.2263 11.2382 12.2073 24.4489 18.6610 51.9954 9.4045 7.5827 107.0428 7.1064 4.0334 3.6251 8.1347 15.4462 3.8744 0.1786 39.8334 18.0048 0.4184 14.5128 3.3616 159.1308 0.1826 3.2410 0.2925 6.8020 10.0792 3.4128 7.1842 29.2950 34.8069 22.5674 24.4223 3.1205 18.7115 6.6176 21.1420 6.9377 18.5803 1.1308 264.5310 5.8037 43.7078 277.2901 80.3186 167.6358 38.1091 0.3408 16.8731 19.9489 1.3868 119.6293 2.9177 1.9368 14.0492 3.5600 127.4475 18.5220 11.7668 13.6015 88.7380 60.8234 5.5560 14.4087 26.3442 13.2578 19.4612 29.4033 20.3419 33.6666 7.7852 317.0211 250.7877 16.9138 83.3801 139.4077 156.6965 67.9097 33.3350 182.7709 67.4606 38.2494 29.5138 30.7605 23.8129 15.9588 9.8027 42.8989 58.7992 68.2067 28.6368 56.7361 17.2336 22.3466 0.2250 31.5803 3.9196 32.5985 7.1135 11.0361 9.6811 7.8916
temp: 298.150 k
press: 1.00000 atm
elementType: 8 8 7 7 6 6 6 6 6 6 6 6 6 6 6 6 6 6 6 6 6 6 6 1 1 1 1 1 1 1 1 1 1 1 1 1 1 1 1 1 1 1 1 1 1 1 1
symmnumber: 1
zpe: 1028001.4 jmol-1
zpe.correction: 0.391545 hartree
zpe.thermalcorrener: 0.414583 hartree
zpe.thermalcorrenthalpy: 0.415527 hartree
zpe.thermalcorrgfe: 0.335683 hartree
zpe.sumelectzpe: -996.657075 hartree
zpe.sumelectthermal: -996.634037 hartree
zpe.sumelectthermalent: -996.633093 hartree
zpe.sumelectthermalfe: -996.712936 hartree
dipole: -3.7834 -2.6909 -1.7678
dipole: 4.9679
quadrupole: -114.2538 -135.1972 -141.6893
quadrupole: -11.0584 -3.2723 1.1758
quadrupole: 16.1263 -4.8171 -11.3092 -11.0584 -3.2723 1.1758
hfenergy: -997.0486197 hartree
pointgroup: C01 [X(C19H24N2O2)]
dipole: 1.4935464 -0.8293957 0.9495281 debye
polarizability: 412.0817011|-2.2910473|188.8565265|-5.8735103|-32.984965|156.7981869 unknown
InChI: InChI=1S/C19H24N2O2/c1-3-21(4-2)14-15-23-18-12-10-16(11-13-18)19(22)20-17-8-6-5-7-9-17/h5-13,20H,3-4,14-15H2,1-2H3
charge 0 multiplicity 1
47 atoms
O  2.765763 -1.057467 0.294318
O  -2.976393 1.469595 -1.296836
N  6.334508 0.013647 0.0304
N  -3.672116 -0.222705 0.175672
C  5.176526 -0.881767 0.269541
C  6.694178 0.818577 1.230547
C  7.496141 -0.669759 -0.598738
C  3.872679 -0.141187 -0.055748
C  7.410144 2.137267 0.882554
C  7.268644 -0.981877 -2.089855
C  1.457458 -0.626218 0.069833
C  1.106262 0.643741 -0.45881
C  0.441402 -1.56044 0.399434
C  -1.281216 0.054527 -0.293047
C  -0.252328 0.965987 -0.637794
C  -0.909226 -1.221361 0.218434
C  -2.699359 0.496267 -0.52692
C  -5.087572 -0.085152 0.132539
C  -5.756863 0.852531 -0.700359
C  -5.848206 -0.943823 0.974259
C  -7.167242 0.911211 -0.678508
C  -7.254986 -0.870178 0.985064
C  -7.926319 0.05945 0.156415
H  5.24653 -1.769742 -0.382545
H  5.134428 -1.256726 1.318047
H  7.318716 0.224432 1.944917
H  5.75597 1.058991 1.765846
H  8.368409 0.00261 -0.510329
H  7.763174 -1.608756 -0.050966
H  3.786001 0.791894 0.536543
H  3.835671 0.111879 -1.132595
H  8.37406 1.96258 0.371592
H  6.778382 2.748601 0.214877
H  7.620312 2.715439 1.801617
H  6.410614 -1.661879 -2.242816
H  7.067893 -0.050095 -2.646658
H  8.161471 -1.469842 -2.523413
H  1.873734 1.373793 -0.731012
H  0.737027 -2.542601 0.780191
H  -0.546899 1.933866 -1.056409
H  -1.663182 -1.986881 0.441401
H  -3.327784 -0.918811 0.839739
H  -5.168509 1.514314 -1.337798
H  -5.335754 -1.669847 1.619838
H  -7.675803 1.636649 -1.323654
H  -7.825661 -1.538641 1.639326
H  -9.019875 0.118112 0.163262
