program: Gaussian 09
title: 000201574
version: EM64L-G09RevD.01
frameworkgroup: C1[X(C8H11OS)]
method: RPBEPBE
basis: SDD
operation: Freq
keyword: #p
keyword: freq=noraman
keyword: PBEPBE/SDD
title: #p freq=noraman PBEPBE/SDD
converged: NO NO NO NO
title: Mulliken charges:
elementType: S O C C C C C C C C H H H H H H H H H H H
charge: 0.370307 -0.208308 0.321578 0.338539 -0.113375 -0.219842 -0.250655 -0.755371 -0.750445 -0.842410 0.277814 0.287210 0.274885 0.279851 0.274928 0.276351 0.276403 0.276360 0.290007 0.306491 0.289681
chargesum: 1.00000
title: Mulliken charges with hydrogens summed into heavy atoms:
elementType: S O C C C C C C C C
charge: 0.370307 -0.208308 0.321578 0.338539 -0.113375 0.057972 0.036555 0.074294 0.078669 0.043770
polarizability: 1.65003963e+02 -9.13979463e-01 1.19813412e+02 7.77412757e-03 4.54770800e-03 5.46798353e+01
1716.lowfreq: -102.4402 -97.2441 -8.3789 0.0013 0.0025 0.0027 9.8676 11.3162 69.7824
frequency: -102.4323 -97.2343 69.6203 139.4125 154.6471 184.0669 198.5071 213.3064 255.3873 281.0832 383.4658 455.0220 521.9901 530.2130 533.2568 548.9987 653.0320 686.5060 802.4170 874.5084 896.0547 907.7989 936.2095 970.4417 994.4506 1000.3376 1008.8808 1037.2290 1039.0222 1090.0173 1164.4873 1270.6519 1286.8858 1359.5214 1362.4859 1401.2149 1405.9750 1416.5128 1448.3870 1448.9659 1451.0555 1457.4514 1460.0155 1463.0358 1536.9671 1626.5317 3001.9857 3003.2510 3021.3406 3082.9023 3084.5621 3132.8642 3133.2753 3149.1042 3150.7887 3176.0290 3192.0619
redmass: 1.0240 1.0215 3.2799 3.1829 3.2361 1.6710 3.7809 1.8003 2.8208 3.4144 8.2468 3.1534 5.2477 3.8754 3.8342 5.0775 7.5384 3.6050 4.8959 1.3375 1.2885 6.6162 4.8129 1.1844 1.8296 1.4902 1.4252 1.5280 1.5424 1.6633 3.9521 1.4113 5.3488 1.2304 1.7523 1.2165 1.2201 2.7994 1.0542 1.0424 1.0425 1.0507 1.1029 1.3225 6.7625 6.4107 1.0387 1.0386 1.0293 1.0972 1.0973 1.0994 1.0994 1.1072 1.1028 1.0941 1.0927
irintensity: 0.1837 1.0816 2.7634 0.0061 1.1710 1.9185 6.3651 1.2343 1.3783 2.4023 1.8909 1.0340 0.8569 0.8934 1.5824 5.4237 2.7157 2.6304 60.4651 28.6143 2.4160 0.5474 3.5676 6.4718 8.0357 1.0532 11.1732 20.0841 1.7513 28.9618 48.8186 8.3980 20.2373 5.7781 7.0607 75.0343 17.7493 4.4297 35.5710 2.8172 51.1777 24.5489 28.0587 11.2515 227.1115 473.4531 6.6558 7.1271 2.4526 0.1292 0.1078 1.4428 1.9074 3.8610 0.2533 3.9459 2.1438
temp: 298.150 k
press: 1.00000 atm
elementType: 16 8 6 6 6 6 6 6 6 6 1 1 1 1 1 1 1 1 1 1 1
symmnumber: 1
zpe: 442942.4 jmol-1
zpe.correction: 0.168708 hartree
zpe.thermalcorrener: 0.178541 hartree
zpe.thermalcorrenthalpy: 0.179485 hartree
zpe.thermalcorrgfe: 0.133259 hartree
zpe.sumelectzpe: -783.729754 hartree
zpe.sumelectthermal: -783.719921 hartree
zpe.sumelectthermalent: -783.718977 hartree
zpe.sumelectthermalfe: -783.765203 hartree
dipole: 0.2300 1.4754 0.0004
dipole: 1.4932
quadrupole: -35.5818 -43.6207 -65.9237
quadrupole: -6.7467 -0.0030 -0.0010
quadrupole: 12.7936 4.7547 -17.5483 -6.7467 -0.0030 -0.0010
hfenergy: -783.8984618 hartree
pointgroup: C01 [X(C8H11O1S1)]
dipole: 0.1376629 0.5649806 -0.0834264 debye
dipolederiv: -0.6570722 0.0860533 -0.049311 -0.156017 0.1547456 -0.0238263 -0.0118268 -0.0115359 0.0548268 -0.7290715 0.0400762 -0.0372663 -0.0328045 -0.6719098 0.0883686 -0.0250309 0.0920847 -0.1252111 1.0059755 0.5252666 -0.0416716 0.217344 0.8831807 -0.1064008 0.0074041 -0.091115 0.1666262 1.2178212 -0.5335924 0.1393408 -0.0828246 0.6506883 -0.0870371 0.0661961 -0.1091788 0.1520717 1.4661191 0.0533391 0.0654661 0.2206619 0.4813492 -0.0668687 0.0390573 -0.0752642 0.0099724 -0.7880248 -0.6244554 0.0651015 -0.5047736 -0.4850292 0.0380904 0.0458752 0.0324075 -0.0926724 -1.0620485 0.5564343 -0.1374235 0.2781106 -0.1692496 0.0259599 -0.0922875 0.0395788 -0.1045215 -0.0504258 -0.0546588 0.0075922 -0.2395686 -0.453284 0.0563743 0.0371867 0.0654291 -0.03594 -0.1762818 0.1614892 -0.0334145 0.3360081 -0.3333405 0.0663422 -0.0609529 0.0573573 -0.0345297 0.1114712 -0.1418497 0.0248825 -0.1186066 0.0763068 -0.0084587 0.0219987 -0.0096509 0.0625483 0.0974045 0.056819 -0.0116153 0.0222 0.0553962 0.0159376 -0.0062544 0.0177068 0.1447739 0.1165767 -0.0399098 0.0041266 -0.0022177 0.0731532 0.0140828 -0.0019972 0.0121095 0.1595923 0.0677403 -0.0500573 -0.0637748 -0.0009697 0.1294684 0.0231867 -0.0501688 0.0272081 0.0247667 0.0053519 0.0090222 -0.0084795 0.0617591 0.1000979 0.0108911 -0.0169058 0.0083425 0.1471076 0.0559206 -0.0231776 0.0774205 0.0187014 0.1041887 -0.0465503 0.0493653 -0.0549739 0.0619835 0.0611821 0.0166012 -0.057334 -0.0304825 0.1077209 -0.070448 -0.0285907 -0.0658606 0.0578485 0.0528508 0.0284788 0.0514185 -0.0254192 0.1434329 0.0410195 0.0388345 0.0414877 0.0308307 0.0341149 -0.0320498 -0.0005192 -0.0853772 0.065477 0.009285 0.0080381 0.0119013 0.148044 0.0796653 -0.0158428 -0.0646517 0.0649151 -0.0196907 -0.0535535 -0.0745232 -0.0325099 0.0176189 0.0249742 -0.0200565 -0.0035958 -0.0198477 0.0970317 0.0078801 -0.0034882 0.0079653 0.1529687 0.0657562 0.00207 0.0737086 0.0792086 0.0102663 0.0657253 0.0580706 0.0365106 0.0012942 unknown
polarizability: 164.2846141|-3.6819958|118.5663687|6.0525895|-10.4048459|56.6462275 unknown
InChI: InChI=1S/C8H11OS/c1-6-4-8(10-3)5-7(2)9-6/h4-5H,1-3H3
charge 1 multiplicity 1
21 atoms
S  -2.72589 -0.950818 -0.208804
O  1.766102 -0.06565 -0.126197
C  0.903097 1.003665 -0.339876
C  1.293399 -1.367288 0.059506
C  -0.995981 -0.530388 -0.188279
C  -0.470699 0.784603 -0.372626
C  -0.074259 -1.604054 0.029997
C  1.611968 2.309666 -0.514321
C  2.384582 -2.36774 0.272735
C  -3.591191 0.689436 -0.513097
H  -1.118997 1.646365 -0.543161
H  -0.428075 -2.62814 0.176583
H  1.378248 2.753172 -1.498751
H  2.700938 2.17318 -0.439179
H  1.292464 3.03429 0.255961
H  2.353469 -3.151214 -0.505335
H  2.268112 -2.871034 1.249114
H  3.370201 -1.879932 0.242707
H  -3.393273 1.390591 0.311266
H  -4.662444 0.440181 -0.529776
H  -3.299273 1.106609 -1.488363
