program: Gaussian 09
title: 000201604
version: EM64L-G09RevD.01
frameworkgroup: C1[X(C14H15NO2S)]
method: RPBEPBE
basis: SDD
operation: Freq
keyword: #p
keyword: freq=noraman
keyword: PBEPBE/SDD
title: #p freq=noraman PBEPBE/SDD
converged: YES YES NO NO
title: Mulliken charges:
elementType: S O O N C C C C C C C C C C C C C C H H H H H H H H H H H H H H H
charge: 0.952440 -0.532310 -0.517601 -0.539845 -0.091391 0.378552 -0.262773 -0.207969 0.450022 -0.504799 0.462301 -0.366064 -0.363105 -0.398890 -0.391297 -0.189779 -0.798250 -0.803978 0.286445 0.285963 0.282622 0.292546 0.244613 0.243862 0.226645 0.233967 0.226420 0.230757 0.229296 0.245063 0.235189 0.239488 0.221861
chargesum: 0.00000
title: Mulliken charges with hydrogens summed into heavy atoms:
elementType: S O O N C C C C C C C C C C C C C C
charge: 0.952440 -0.532310 -0.517601 -0.253400 -0.091391 0.378552 0.023190 0.074653 0.450022 -0.212253 0.462301 -0.121451 -0.119243 -0.172246 -0.157331 0.036641 -0.093135 -0.107440
polarizability: 2.32974251e+02 -1.63222191e+01 2.04511092e+02 -2.04464383e+01 2.60698291e+00 1.58510121e+02
1716.lowfreq: -10.6799 -7.1817 0.0009 0.0012 0.0013 4.1138 5.9965 11.4883 20.2294
frequency: 4.1388 10.9742 20.0296 27.4983 38.5536 75.3530 76.4268 126.6238 133.6531 187.1072 197.9693 209.3328 223.0822 256.2255 291.6483 298.1024 340.0069 378.0393 392.0788 407.0818 432.2313 437.7482 449.6686 500.9677 510.2140 544.6332 576.3708 584.0324 621.3400 690.1956 705.1309 728.7224 774.3263 785.4733 793.1922 820.2674 826.6702 848.3986 883.3349 909.6715 931.2508 957.6091 960.7014 974.0583 980.6673 984.3609 991.0492 991.9039 1007.3887 1048.1829 1048.7291 1049.5199 1094.7036 1117.9643 1168.8697 1178.6415 1183.8563 1217.7971 1232.9476 1265.9302 1295.8697 1316.9697 1380.5373 1384.3887 1390.9748 1398.1338 1399.8464 1435.8396 1470.3165 1471.1564 1472.9629 1473.9661 1474.2127 1479.3664 1581.0314 1592.0441 1593.9676 1609.5077 2979.1037 2981.3218 3060.0265 3063.7152 3090.8249 3092.5048 3118.8851 3128.5867 3134.9354 3136.8833 3153.8449 3158.1149 3159.5368 3167.7343 3386.7393
redmass: 1.0226 2.5550 1.3028 3.4779 3.8085 5.2106 5.7416 6.2635 4.6919 8.9750 7.8787 3.1048 7.9420 4.7619 4.2587 4.8897 3.3673 3.8013 8.2004 2.8685 4.3969 2.8999 3.3469 3.3154 4.7046 4.8715 5.2455 5.3714 6.9526 1.9500 3.3327 4.8619 4.0769 1.8354 1.7660 2.8835 1.6375 1.2426 1.3341 1.5123 2.6698 6.2460 1.3051 1.3481 1.4145 5.8471 1.7119 3.3981 1.6018 1.5818 2.2762 1.6644 1.5916 1.2848 1.8896 1.0891 1.1388 2.9977 1.2121 4.1067 1.2643 1.2966 5.9710 6.5637 3.0538 1.2269 1.2206 2.1392 2.3248 1.1038 1.9409 1.0718 1.0654 1.3698 5.6664 6.9090 6.0005 6.0021 1.0384 1.0388 1.0957 1.0949 1.0997 1.1001 1.0862 1.0915 1.0887 1.0896 1.0978 1.0961 1.0942 1.0959 1.0755
irintensity: 0.6906 0.3961 0.1415 0.6465 0.1119 4.4663 0.4409 1.3065 2.3096 5.2492 0.8803 3.2802 7.3536 9.8902 0.5708 0.3170 5.0351 2.4377 15.9093 0.0209 27.5886 54.4600 42.6863 83.6600 9.7172 0.2623 10.1721 22.7927 0.2131 21.8705 1.4811 4.7626 6.0597 55.6540 12.2577 192.9367 26.7534 0.5581 1.6747 8.3107 2.4044 48.2924 1.7153 0.2329 1.0362 0.3244 2.6268 1.8747 9.5726 28.9019 22.8440 13.4257 8.9616 7.6991 1.5054 1.9835 9.2084 6.9292 3.3960 2.6945 2.5328 2.4906 0.2178 0.5430 10.4060 15.5523 15.8127 1.4434 21.2740 16.7635 14.2718 11.0968 16.4213 31.2416 5.1855 0.0333 11.4846 28.5852 31.2750 23.2039 18.3765 16.4528 14.3119 14.4803 1.0369 18.3510 12.3008 6.8535 22.8982 6.8203 3.9439 4.8501 15.8215
temp: 298.150 k
press: 1.00000 atm
elementType: 16 8 8 7 6 6 6 6 6 6 6 6 6 6 6 6 6 6 1 1 1 1 1 1 1 1 1 1 1 1 1 1 1
symmnumber: 1
zpe: 667136.4 jmol-1
zpe.correction: 0.254099 hartree
zpe.thermalcorrener: 0.272775 hartree
zpe.thermalcorrenthalpy: 0.273719 hartree
zpe.thermalcorrgfe: 0.201128 hartree
zpe.sumelectzpe: -1144.279181 hartree
zpe.sumelectthermal: -1144.260505 hartree
zpe.sumelectthermalent: -1144.259561 hartree
zpe.sumelectthermalfe: -1144.332152 hartree
dipole: -1.7521 -7.2735 1.8768
dipole: 7.7134
quadrupole: -98.4153 -125.3897 -109.3607
quadrupole: 2.7897 -5.0512 5.7996
quadrupole: 12.6399 -14.3344 1.6945 2.7897 -5.0512 5.7996
hfenergy: -1144.5332799 hartree
pointgroup: C01 [X(C14H15N1O2S1)]
dipole: -0.5771906 2.8838517 -0.7480538 debye
polarizability: 232.6477921|15.2726705|203.5083084|22.8135232|2.5604117|159.8393637 unknown
InChI: InChI=1S/C14H15NO2S/c1-11-6-8-14(9-7-11)18(16,17)15-13-5-3-4-12(2)10-13/h3-10,15H,1-2H3
charge 0 multiplicity 1
33 atoms
S  -0.41928 -2.155428 0.254314
O  -1.191979 -3.405675 -0.440071
O  0.228921 -2.221559 1.74027
N  1.067678 -1.818131 -0.958279
C  -1.575014 -0.657926 0.211341
C  1.766062 -0.590679 -0.784689
C  -2.64537 -0.676177 -0.698351
C  -1.323711 0.40922 1.089389
C  -3.290996 1.555261 0.135718
C  2.536346 -0.405953 0.397591
C  3.284839 0.776471 0.594473
C  -3.503944 0.444546 -0.724395
C  -2.194294 1.519793 1.037857
C  1.745379 0.423696 -1.782636
C  3.273701 1.771093 -0.422256
C  2.521399 1.587647 -1.604249
C  -4.238688 2.74031 0.11671
C  4.123928 0.959645 1.847668
H  0.642131 -1.946703 -1.894674
H  -2.814947 -1.548218 -1.338698
H  -0.490724 0.362673 1.797612
H  2.545843 -1.204955 1.146148
H  -4.35228 0.453558 -1.418415
H  -2.019974 2.36761 1.710187
H  1.13736 0.292612 -2.686626
H  3.860679 2.687366 -0.286438
H  2.524255 2.361785 -2.37966
H  -3.718093 3.680791 0.367476
H  -4.715897 2.863774 -0.870744
H  -5.048958 2.605784 0.859233
H  3.752652 0.334806 2.677785
H  5.177011 0.671898 1.663161
H  4.127063 2.012462 2.182347
