program: Gaussian 09
title: 000201570
version: EM64L-G09RevD.01
frameworkgroup: C1[X(C3H8N4S2)]
method: RPBEPBE
basis: SDD
operation: Freq
keyword: #pfreq=noraman
keyword: PBEPBE/SDD
title: #p freq=noraman PBEPBE/SDD
converged: YES YES NO NO
title: Mulliken charges:
elementType: S S N N N N C C C H H H H H H H H
charge: 0.187362 0.134458 -0.544920 -0.593769 -0.300479 -0.331375 -0.859778 -0.125034 -0.078159 0.313851 0.378393 0.342508 0.327777 0.324158 0.334866 0.248952 0.241189
chargesum: 0.00000
title: Mulliken charges with hydrogens summed into heavy atoms:
elementType: S S N N N N C C C
charge: 0.187362 0.134458 0.125365 0.065255 -0.051526 -0.090186 -0.167534 -0.125034 -0.078159
polarizability: 1.43006556e+02 -1.54918229e+00 8.91827051e+01 6.72093409e+00 3.85182370e+00 6.98353386e+01
1716.lowfreq: -8.4927 -0.0017 0.0007 0.0027 7.0437 13.8497 26.6394 42.4338 52.3431
frequency: 26.1867 42.3857 52.3153 102.6133 145.4517 217.7731 226.2831 356.1757 365.3304 371.8029 407.8390 438.1138 449.1490 457.3276 512.2565 559.3011 563.3549 568.8322 600.0813 621.1730 667.1633 720.2676 740.5487 847.3498 963.1882 1035.8218 1045.0521 1100.9490 1152.6847 1220.4538 1260.5157 1277.1244 1414.3492 1602.2171 1616.5451 1659.5640 1686.4621 3009.0687 3132.6164 3398.4371 3452.9770 3473.1440 3521.2235 3644.2472 3668.6046
redmass: 4.9480 5.9470 4.6010 7.0446 7.5755 2.7161 6.4970 1.1960 4.0171 3.6737 4.6844 1.2302 2.0681 1.9398 1.2449 2.9820 3.2605 2.6539 4.5832 7.3139 6.7939 1.4338 1.1033 1.4790 1.6221 1.2664 1.6579 2.1163 1.0331 1.2617 2.3036 2.6077 1.0679 1.1775 1.1766 5.2446 5.8487 1.0599 1.1056 1.0780 1.0780 1.0495 1.0449 1.1019 1.1043
irintensity: 5.9455 3.0977 0.6226 9.2025 4.4471 3.1960 3.5282 8.6202 2.5457 8.4393 11.1588 282.7126 10.1993 45.1684 142.6835 14.1858 74.4248 87.0486 90.9556 10.9471 66.0446 88.5548 79.2001 13.5522 147.4121 260.1169 8.3884 15.7367 7.6295 115.1128 159.9351 186.0322 10.4625 55.5139 111.0354 279.2770 274.7435 31.1805 9.4612 15.3695 29.6322 115.9223 37.7899 77.2129 24.4896
temp: 298.150 k
press: 1.00000 atm
elementType: 16 16 7 7 7 7 6 6 6 1 1 1 1 1 1 1 1
symmnumber: 1
zpe: 325350.3 jmol-1
zpe.correction: 0.123919 hartree
zpe.thermalcorrener: 0.135559 hartree
zpe.thermalcorrenthalpy: 0.136504 hartree
zpe.thermalcorrgfe: 0.084738 hartree
zpe.sumelectzpe: -1133.513274 hartree
zpe.sumelectthermal: -1133.501634 hartree
zpe.sumelectthermalent: -1133.500689 hartree
zpe.sumelectthermalfe: -1133.552455 hartree
dipole: -6.2791 0.9173 -0.1818
dipole: 6.3484
quadrupole: -57.3283 -67.7459 -70.0373
quadrupole: -10.6882 4.3536 -1.8273
quadrupole: 7.7089 -2.7088 -5.0001 -10.6882 4.3536 -1.8273
hfenergy: -1133.637193 hartree
pointgroup: C01 [X(C3H8N4S2)]
dipole: -2.3572749 -0.5494669 -0.6161117 debye
dipolederiv: -0.5248345 -0.1899658 0.2182432 -0.1137746 -0.1170659 0.024712 0.4032331 -0.0389756 -0.3605296 -0.7051831 -0.0466156 -0.2041907 -0.0494049 -0.2086712 0.0089269 -0.2772048 0.0012577 -0.3171664 -0.8880356 -0.0702501 -0.1655954 -0.1062161 -0.6659475 -0.1580312 -0.228598 -0.2331716 -0.6858655 -1.0764732 -0.4003186 -0.0077587 -0.2795573 -0.750258 -0.2175536 -0.2031805 -0.3488967 -0.5514756 -1.3659262 -0.3052844 0.130129 -0.2733871 -0.5651579 0.0929161 0.5770271 0.2173011 -0.5062163 -0.4061382 -0.1463381 0.1105164 0.2212465 -1.1650786 0.3542982 -0.0362166 0.2078089 -0.4951474 0.7529441 0.2381024 0.1065418 0.4420882 0.14769 0.1941455 0.0931381 0.2041165 -0.0728614 1.547989 0.617319 -0.1927914 0.5907587 0.4028459 0.1788939 -0.5463844 0.1110185 1.1702387 1.1031735 0.4088852 0.4729393 -0.04904 1.2846803 -0.3922196 0.8112919 -0.2009284 0.5771849 -0.0713137 -0.038921 0.0542333 -0.0560978 0.0523584 -0.08467 0.011866 -0.0709553 0.0001128 0.0835588 0.0055239 0.031384 -0.1296784 0.0298217 -0.0166211 0.0691973 0.0130492 0.1352614 0.4025466 -0.0575655 -0.0704391 -0.0281214 0.2638533 -0.0014922 -0.1389379 0.0125801 0.183843 0.2049409 -0.0844923 0.019652 -0.0961973 0.3232556 -0.0145175 0.0478981 -0.0005121 0.1494779 0.2222199 -0.0232233 -0.1126998 -0.0375717 0.1884914 0.0781321 -0.1190332 0.0826653 0.2591077 0.3154599 -0.0164678 -0.0901115 -0.000718 0.2155693 0.0819997 -0.0694599 0.1054304 0.2801212 0.4098483 0.0091569 -0.0679082 0.0105334 0.250989 -0.1104471 -0.1784158 -0.1306261 0.1041265 -0.0047767 0.1004551 -0.2321442 -0.0448622 0.3126241 -0.0184719 -0.2162206 0.0688381 0.1297882 unknown
polarizability: 135.7848018|21.2730343|77.0484983|8.6625818|-3.315368|89.1912994 unknown
InChI: InChI=1S/C3H8N4S2/c4-2(5)8-1-9-3(6)7/h4,6H,1,5,7H2
charge 0 multiplicity 1
17 atoms
S  1.822587 0.368905 1.607561
S  -0.965783 -0.966878 0.924277
N  1.637623 -0.120365 -1.108198
N  -3.148974 -1.140119 -0.646443
N  3.650243 0.931285 -0.485904
N  -2.005922 1.014682 -0.680003
C  -0.021201 0.613913 1.413747
C  2.4870 0.438734 -0.181299
C  -2.17956 -0.212269 -0.289763
H  -0.387139 0.937056 2.398119
H  -0.277947 1.344375 0.626113
H  0.801682 -0.63784 -0.829901
H  1.901472 -0.055758 -2.09026
H  -3.853693 -0.90567 -1.343594
H  -3.208171 -2.04508 -0.181537
H  4.152732 1.407079 0.279321
H  -2.700751 1.403053 -1.341334
