program: Gaussian 09
title: 000201578
version: EM64L-G09RevD.01
frameworkgroup: C1[X(C14H21N)]
method: RPBEPBE
basis: SDD
operation: Freq
keyword: #pfreq=noraman
keyword: PBEPBE/SDD
title: #p freq=noraman PBEPBE/SDD
converged: YES YES NO NO
title: Mulliken charges:
elementType: N C C C C C C C C C C C C C C H H H H H H H H H H H H H H H H H H H H H
charge: -0.298708 -0.025679 -0.440294 -0.429558 -0.347040 -0.409214 -0.409941 -0.382377 0.546860 -0.453526 -0.403699 -0.641022 -0.227356 -0.246665 -0.247629 0.185279 0.186807 0.223228 0.237927 0.177640 0.214135 0.195989 0.189700 0.188534 0.196020 0.195819 0.187512 0.252482 0.231381 0.225697 0.221588 0.220631 0.212963 0.223341 0.222328 0.226845
chargesum: 0.00000
title: Mulliken charges with hydrogens summed into heavy atoms:
elementType: N C C C C C C C C C C C C C C
charge: -0.046227 0.159600 -0.030259 -0.013991 -0.132905 -0.023525 -0.025387 0.000955 0.546860 -0.222144 -0.178002 0.014160 -0.004015 -0.024336 -0.020784
polarizability: 1.79732067e+02 1.92498660e+01 1.39644364e+02 5.09520418e+00 -5.73172042e+00 1.35050118e+02
1716.lowfreq: -6.6919 -0.0004 0.0004 0.0005 12.7880 17.1587 33.1340 50.9682 70.6046
frequency: 27.1832 50.8630 70.3499 75.4759 110.3975 154.6532 183.0273 216.6573 227.1879 257.5669 264.7781 317.2957 336.2560 385.6913 402.2607 430.5815 435.2720 473.8884 533.1492 580.8023 603.9902 616.7818 657.1160 707.5213 768.6844 787.5889 797.6513 814.2808 848.8729 853.4184 884.1133 895.5095 917.0420 919.0381 952.8033 973.8008 977.2576 989.5004 992.6625 1024.6371 1050.9951 1052.9283 1066.1222 1072.6645 1085.4186 1105.3510 1114.0126 1115.2681 1134.1521 1162.3672 1170.7451 1183.3302 1186.4691 1196.2621 1226.5989 1251.7772 1257.2184 1271.6629 1291.2271 1299.5793 1328.1117 1330.4132 1332.6102 1339.1470 1340.5152 1341.3900 1358.3174 1383.5430 1431.7796 1439.6968 1444.7150 1461.1317 1462.1391 1463.7121 1464.8745 1470.4814 1477.7526 1478.8870 1494.9693 1590.2757 1607.5128 2901.6749 2920.3590 2952.2421 2957.1966 2961.0067 2961.2228 2962.5532 2970.5690 3015.7547 3021.6254 3022.2058 3031.9049 3038.0046 3054.4210 3071.4975 3106.5195 3109.5494 3127.6447 3138.8556 3159.2963 3424.7600
redmass: 3.6248 2.9034 3.9353 2.6376 2.7490 1.6148 2.8763 2.0767 1.9813 2.6542 3.2628 1.8470 3.7202 3.2929 2.8009 2.0861 2.8938 2.1971 2.8368 2.2159 2.5571 5.9613 2.0209 1.6469 2.0436 1.4907 2.2047 3.6241 2.0532 1.2505 1.9679 1.4453 1.5111 1.8397 2.0840 1.4412 2.0641 6.1171 1.3175 2.2459 1.4115 1.4014 1.9380 1.3983 1.8396 1.7662 1.7852 2.1351 3.1370 1.8807 1.0670 1.7199 1.2131 1.8844 1.6458 1.2660 1.2697 1.3544 1.3220 1.3225 1.2585 1.4481 1.3794 1.3378 1.4898 1.5492 1.5143 6.1238 1.1438 2.1216 1.1923 1.0901 1.0871 1.0592 1.0922 1.0838 2.2104 1.0952 1.0422 5.9554 6.0529 1.0511 1.0798 1.0674 1.0695 1.0618 1.0598 1.0664 1.0806 1.0802 1.0958 1.0983 1.0993 1.0997 1.0949 1.0997 1.0867 1.0872 1.0897 1.0953 1.1012 1.0739
irintensity: 0.1415 0.0339 0.0780 1.0297 0.7196 1.3141 0.0880 1.5861 0.3752 2.4494 1.1359 0.6665 0.7018 5.2504 0.1638 3.2713 1.4078 0.9558 11.7980 32.9590 12.6888 0.6224 122.7203 60.3192 33.0645 0.7338 2.6952 27.2158 5.1669 0.2569 0.9626 8.5218 4.4505 1.1085 3.0079 1.3502 13.6354 0.8178 0.0980 4.2888 1.3122 1.7595 5.7507 2.4043 7.3188 12.1777 1.6596 0.2344 28.7206 5.7218 0.1473 1.8515 0.2569 2.9832 1.9875 8.9181 2.7259 5.1808 2.3015 2.5460 2.6209 0.4862 0.3025 2.2005 0.3267 1.3878 2.2338 0.2857 4.5397 7.8423 13.8974 7.5052 1.2176 6.8586 10.3044 18.2765 11.5004 2.0710 14.0028 1.8986 6.1594 100.5698 10.1338 20.7155 4.2371 27.2574 43.2098 37.7882 68.9062 47.5044 93.8547 63.2731 36.0891 85.6684 36.2486 35.4920 10.5405 9.3226 4.9163 44.9442 29.7470 2.0106
temp: 298.150 k
press: 1.00000 atm
elementType: 7 6 6 6 6 6 6 6 6 6 6 6 6 6 6 1 1 1 1 1 1 1 1 1 1 1 1 1 1 1 1 1 1 1 1 1
symmnumber: 1
zpe: 835954.0 jmol-1
zpe.correction: 0.318398 hartree
zpe.thermalcorrener: 0.333037 hartree
zpe.thermalcorrenthalpy: 0.333981 hartree
zpe.thermalcorrgfe: 0.276109 hartree
zpe.sumelectzpe: -599.678908 hartree
zpe.sumelectthermal: -599.664269 hartree
zpe.sumelectthermalent: -599.663325 hartree
zpe.sumelectthermalfe: -599.721197 hartree
dipole: -0.7875 -0.1113 0.3130
dipole: 0.8547
quadrupole: -91.4450 -94.4793 -85.9471
quadrupole: 0.1842 0.4139 -1.2234
quadrupole: -0.8212 -3.8555 4.6767 0.1842 0.4139 -1.2234
hfenergy: -599.9973061 hartree
pointgroup: C01 [X(C14H21N1)]
dipole: -0.3160071 0.0148225 -0.1139877 debye
polarizability: 179.5392286|-20.2189082|136.8912418|-2.7007378|-5.1371175|137.9960784 unknown
InChI: InChI=1S/C14H21N/c1-15-14(12-8-4-2-5-9-12)13-10-6-3-7-11-13/h2,4-5,8-9,13-15H,3,6-7,10-11H2,1H3
charge 0 multiplicity 1
36 atoms
N  -0.108347 -2.26944 0.077147
C  1.293204 -0.227064 -0.205108
C  1.473247 1.275711 0.134494
C  2.570108 -1.013791 0.188281
C  0.027893 -0.837006 0.469328
C  2.736049 1.86549 -0.538893
C  3.832967 -0.435049 -0.490744
C  4.008308 1.067541 -0.166792
C  -1.258956 -0.0370 0.19662
C  -2.090833 0.386559 1.26269
C  -1.682849 0.231036 -1.13302
C  -1.091139 -3.054365 0.851496
C  -3.309197 1.06234 1.015604
C  -2.89545 0.906791 -1.387071
C  -3.715883 1.325936 -0.311562
H  1.171519 -0.310432 -1.310348
H  1.562354 1.384119 1.237075
H  0.579396 1.851391 -0.170383
H  2.43551 -2.081591 -0.059453
H  2.692252 -0.957432 1.291717
H  0.204696 -0.831068 1.566098
H  2.852968 2.929631 -0.25438
H  2.60311 1.843067 -1.641059
H  3.749235 -0.562809 -1.590769
H  4.728484 -1.003947 -0.172241
H  4.888812 1.478716 -0.69859
H  4.205034 1.183351 0.919579
H  -0.265659 -2.354229 -0.937756
H  -1.779429 0.187482 2.296349
H  -1.056889 -0.085393 -1.977809
H  -0.781856 -3.07455 1.913237
H  -1.093741 -4.097019 0.486122
H  -2.13605 -2.667509 0.811985
H  -3.937939 1.380826 1.855202
H  -3.202793 1.109736 -2.419673
H  -4.658335 1.849572 -0.507675
