program: Gaussian 09
title: 000201552
version: EM64L-G09RevD.01
frameworkgroup: C1[X(C7H15O2P)]
method: RPBEPBE
basis: SDD
operation: Freq
keyword: #p
keyword: freq=noraman
keyword: PBEPBE/SDD
title: #p freq=noraman PBEPBE/SDD
converged: YES YES NO NO
title: Mulliken charges:
elementType: P O O C C C C C C C H H H H H H H H H H H H H H H
charge: 1.172437 -0.545538 -0.661013 0.036092 -0.788966 -0.893633 -0.673111 -0.661385 0.018824 -0.564904 0.240512 0.257476 0.266045 0.252689 0.279473 0.256102 0.202736 0.242558 0.216922 0.203380 0.228182 0.218538 0.253583 0.223755 0.219245
chargesum: 0.00000
title: Mulliken charges with hydrogens summed into heavy atoms:
elementType: P O O C C C C C C C
charge: 1.172437 -0.545538 -0.661013 0.276604 -0.265445 -0.105368 -0.010896 -0.011285 0.272407 -0.121903
polarizability: 1.06880305e+02 2.96587683e+00 1.24178632e+02 -8.93814862e-01 -4.05546606e-01 9.05850770e+01
1716.lowfreq: -8.7517 -0.0010 -0.0005 0.0018 7.4141 12.4456 18.1155 44.8946 51.7531
frequency: 16.9117 44.8092 51.6741 78.9283 128.5889 135.6332 150.1826 192.6420 194.8293 216.2666 233.3126 247.9440 331.1586 339.9188 375.7570 384.0478 397.0576 443.6135 558.7037 627.1765 699.7011 708.9017 832.6976 849.1994 909.9274 916.2006 924.9938 931.7315 934.1748 947.5488 951.9722 1002.1332 1021.1837 1085.1104 1105.5924 1155.9464 1179.3771 1200.4699 1232.2741 1294.9874 1326.5431 1330.8954 1347.4404 1375.3191 1389.1981 1404.3465 1429.3946 1432.8925 1442.1877 1455.7024 1464.9161 1468.1868 1483.9639 1654.8774 2981.6615 2985.7389 2993.5139 2994.3094 3014.5746 3078.0193 3082.2160 3085.6523 3090.5923 3091.7685 3097.0916 3120.7149 3134.9339 3139.9258 3201.0475
redmass: 2.7772 3.4628 3.6453 2.6709 2.1282 1.3745 2.5210 3.1260 1.0596 3.1450 1.2666 2.3680 3.0305 3.0728 3.4681 2.9250 2.8917 2.6956 2.2174 3.5019 5.3128 2.1754 3.4590 1.6835 1.8529 2.3896 1.3293 1.7085 1.2901 1.4196 1.3915 1.2823 2.8286 1.5669 1.7420 2.1746 1.9718 1.4494 1.2674 1.2020 1.2573 1.1846 1.2949 1.2629 1.2236 1.0990 1.0728 1.1422 1.0486 1.0502 1.0474 1.0498 1.0486 4.5939 1.0351 1.0354 1.0618 1.0850 1.0317 1.0990 1.0994 1.0985 1.0642 1.0977 1.1004 1.0946 1.1021 1.1014 1.1146
irintensity: 0.3841 0.7515 1.4607 1.8332 6.8163 2.3991 5.6038 0.4747 0.0302 6.0716 2.5558 4.6381 9.9554 1.3075 3.9108 8.0749 26.4758 6.1956 27.4994 50.5485 48.9071 4.3219 110.2928 44.3287 52.2207 87.6299 5.7604 2.6842 1.1343 4.8893 143.9394 20.7128 73.7993 42.4302 62.4997 11.7236 19.0965 5.1661 5.8726 0.3447 13.8490 15.3623 5.2432 26.8170 20.9583 9.4565 6.8749 17.4092 9.1455 5.6146 0.6931 8.7864 12.3465 14.8793 20.1777 27.0154 7.1241 9.3457 4.8897 3.4480 2.8325 60.1515 5.7305 17.1524 37.2978 5.0566 6.3150 3.7998 21.9804
temp: 298.150 k
press: 1.00000 atm
elementType: 15 8 8 6 6 6 6 6 6 6 1 1 1 1 1 1 1 1 1 1 1 1 1 1 1
symmnumber: 1
zpe: 545083.8 jmol-1
zpe.correction: 0.207611 hartree
zpe.thermalcorrener: 0.221791 hartree
zpe.thermalcorrenthalpy: 0.222735 hartree
zpe.thermalcorrgfe: 0.165385 hartree
zpe.sumelectzpe: -766.563924 hartree
zpe.sumelectthermal: -766.549744 hartree
zpe.sumelectthermalent: -766.548800 hartree
zpe.sumelectthermalfe: -766.606150 hartree
dipole: 0.6105 0.2374 -2.8040
dipole: 2.8795
quadrupole: -65.7758 -63.9087 -76.3017
quadrupole: -2.1901 -2.9153 5.9758
quadrupole: 2.8863 4.7533 -7.6396 -2.1901 -2.9153 5.9758
hfenergy: -766.7715351 hartree
pointgroup: C01 [X(C7H15O2P1)]
dipole: -0.5355575 -0.6176397 -0.7842733 debye
dipolederiv: 1.7758713 -0.1048521 -0.0910869 -0.3309056 1.593147 -0.2170821 -0.0924656 -0.1036448 1.2868949 -1.1963672 0.4834983 -0.1587192 0.5821278 -0.9600866 0.1613863 -0.2855358 0.2519839 -0.5875471 -0.7322202 -0.0282681 0.0252751 0.0327775 -0.7512429 0.0035809 0.0113509 -0.0229234 -0.6540316 0.8037659 -0.3121244 0.1165393 -0.1957603 0.4394579 -0.1238592 0.4046245 -0.4127969 0.3422702 -0.2240998 -0.0759458 0.025297 -0.1027702 -0.174376 0.0959519 0.0608551 0.0862111 -0.2850489 -0.2998946 -0.0470582 0.0539825 -0.0300591 -0.2346262 0.1028131 0.0145255 0.1390805 -0.4034091 -0.0562174 -0.0382491 0.0392175 -0.0136391 -0.1255794 0.0943218 -0.0127705 0.1299643 0.0330287 -0.1814614 0.0119321 0.0662256 -0.0117541 0.0171183 0.0365702 0.0396451 0.0676638 0.0412491 -0.2797926 0.0374796 0.0689253 0.0837599 0.0952756 -0.0060481 -0.2327657 -0.1480884 0.2770958 -0.410999 0.0403844 0.007392 0.0355362 -0.1080512 0.1149495 0.0545403 0.1407929 0.0253204 0.025605 0.0199757 0.0285591 -0.0251076 0.001693 -0.0820494 -0.0255401 -0.0088119 -0.0473895 -0.0097141 0.0910856 -0.0403713 0.0732865 -0.0159567 0.0609418 0.0201106 0.0718734 0.0343387 0.0516897 -0.0526374 -0.0073842 -0.049389 -0.0097304 -0.1014141 0.0131473 -0.0347833 -0.0077135 0.033625 0.107024 -0.0149346 0.1081867 -0.007012 0.0236171 -0.0180018 0.0292824 0.0744505 -0.0272656 -0.0557451 0.0365507 -0.0713516 0.0947855 0.0259254 0.0670259 0.0354854 0.0674107 0.105891 -0.0341831 -0.0412755 -0.0383498 0.0213293 -0.0752234 -0.0416084 -0.0660805 -0.0151572 -0.0293842 0.0774995 -0.1286115 0.0667288 0.0198996 0.0566237 -0.1287184 0.0821073 -0.0180082 -0.0881505 -0.0504703 0.0968953 -0.0326626 0.0749664 0.0018326 0.0942545 -0.0022786 0.0518292 0.0952914 0.0015275 0.0158442 -0.0054339 -0.0069921 -0.0687712 0.0183512 -0.1478104 -0.060366 -0.0843758 0.0771552 -0.0867941 0.0806327 0.0714168 0.056024 -0.1235395 0.0559301 -0.0192833 0.0811174 -0.0366043 0.0235144 -0.0768875 -0.1230919 0.067486 0.0432012 0.0546913 0.0680193 0.0833407 -0.0296317 -0.0174537 0.0150367 0.0116487 -0.1222843 0.0491137 -0.1064076 -0.0589004 0.1706049 -0.0355167 -0.0292046 -0.0187428 0.0086265 -0.0791237 0.0228519 -0.0306903 -0.0181148 0.2114597 -0.0138638 0.0079707 -0.0543302 0.0623453 0.0518158 0.0564166 0.0545169 -0.0981007 0.1816803 -0.0324119 0.0036469 -0.0209296 0.0050355 -0.0779844 -0.0090684 -0.1152673 -0.0288371 unknown
polarizability: 107.0537659|1.888903|112.0580876|-5.7137974|-15.2661297|102.5321611 unknown
InChI: InChI=1S/C7H15O2P/c1-5-6-10(4,8)9-7(2)3/h5,7H,1,6H2,2-4H3
charge 0 multiplicity 1
25 atoms
P  -0.127233 1.248731 -0.583884
O  0.840542 -0.186697 -0.877547
O  0.403034 2.176226 0.616231
C  1.838081 -0.618994 0.158406
C  -1.878483 0.561734 -0.305983
C  -0.101379 2.004456 -2.288952
C  1.461869 -2.040794 0.594873
C  3.228776 -0.522417 -0.483589
C  -2.082173 0.125603 1.122625
C  -2.396314 -1.139584 1.499758
H  1.768398 0.083587 1.013216
H  -2.565539 1.39151 -0.564553
H  -2.027537 -0.265435 -1.020764
H  -0.795671 2.85913 -2.329791
H  0.922767 2.352152 -2.494305
H  -0.384913 1.245356 -3.035085
H  2.181935 -2.412127 1.347998
H  0.451434 -2.0570 1.038764
H  1.478459 -2.72613 -0.271393
H  4.004252 -0.868209 0.225242
H  3.455278 0.520416 -0.765281
H  3.277005 -1.151576 -1.390252
H  -1.94988 0.907252 1.883185
H  -2.536955 -1.399532 2.554656
H  -2.528753 -1.945861 0.767629
