program: Gaussian 09
title: 000201544
version: EM64L-G09RevD.01
frameworkgroup: C1[X(C6H9N3O2)]
method: RPBEPBE
basis: SDD
operation: Freq
keyword: #pfreq=noraman
keyword: PBEPBE/SDD
title: #p freq=noraman PBEPBE/SDD
converged: NO YES NO NO
title: Mulliken charges:
elementType: O O N N N C C C C C C H H H H H H H H H
charge: -0.175999 -0.255978 -0.183433 -0.042919 0.080555 0.283480 0.103894 0.115994 -0.767936 -0.627746 -0.774759 0.242194 0.256282 0.243053 0.237612 0.235878 0.303055 0.229497 0.267707 0.229570
chargesum: 0.00000
title: Mulliken charges with hydrogens summed into heavy atoms:
elementType: O O N N N C C C C C C
charge: -0.175999 -0.255978 -0.183433 -0.042919 0.080555 0.283480 0.103894 0.115994 -0.026406 0.148799 -0.047985
polarizability: 1.42948870e+02 3.64641542e+00 1.08954512e+02 -7.12226027e-02 1.48270781e-02 5.17216201e+01
1716.lowfreq: -29.2831 -7.9777 -3.7257 -0.0010 -0.0009 -0.0009 9.1235 32.2677 34.6578
frequency: -28.6059 32.2097 33.2895 108.1170 128.5608 158.6966 204.8588 244.3457 269.4062 324.5035 338.0410 387.1854 397.6330 568.3317 581.1104 614.4525 665.8561 690.0546 700.5259 724.9144 808.6848 959.0115 977.5473 1031.9868 1050.8722 1099.7869 1115.1161 1126.7892 1172.6116 1245.3967 1276.1959 1347.2169 1368.6878 1374.3576 1392.9190 1406.6482 1423.6938 1451.1741 1462.5945 1463.1494 1469.8481 1474.1175 1484.0288 1500.8962 1551.4233 2975.8821 2983.9742 3000.1649 3046.9539 3059.4295 3085.8980 3106.2438 3112.6454 3153.1429
redmass: 1.0281 2.8746 1.3629 3.6295 1.0491 3.2283 5.2099 2.5443 4.1232 2.8668 4.4563 5.9381 8.5634 4.4144 3.7657 9.6664 4.4097 12.3482 5.4623 8.3251 4.4788 2.0150 1.7602 1.3970 1.5373 2.0226 3.3092 1.3135 5.4469 7.2953 4.6334 10.0680 5.1857 2.7951 1.5061 1.3525 2.2636 1.3371 1.1630 1.1806 1.1045 1.0451 1.2735 1.0440 5.5862 1.0393 1.0386 1.0361 1.0977 1.0981 1.1022 1.0961 1.0973 1.0985
irintensity: 0.0020 0.7014 0.5466 0.5021 0.3877 2.3600 0.6318 1.3909 0.8450 5.9840 3.8652 0.4503 0.2373 0.2646 0.5390 6.2103 0.1050 0.9563 2.2014 28.8526 11.3463 6.9067 24.4115 5.4611 0.1141 21.1851 47.1230 0.4080 207.3676 81.3584 31.2836 236.4032 104.2309 21.8937 1.9740 54.2550 9.8351 17.1066 22.6150 24.6937 2.1570 4.1986 0.5724 30.4024 84.4816 22.5017 23.4168 39.1057 15.3874 19.5508 17.9941 10.1402 4.2907 5.6634
temp: 298.150 k
press: 1.00000 atm
elementType: 8 8 7 7 7 6 6 6 6 6 6 1 1 1 1 1 1 1 1 1
symmnumber: 1
zpe: 399141.1 jmol-1
zpe.correction: 0.152025 hartree
zpe.thermalcorrener: 0.162924 hartree
zpe.thermalcorrenthalpy: 0.163868 hartree
zpe.thermalcorrgfe: 0.113941 hartree
zpe.sumelectzpe: -547.816489 hartree
zpe.sumelectthermal: -547.805589 hartree
zpe.sumelectthermalent: -547.804645 hartree
zpe.sumelectthermalfe: -547.854573 hartree
dipole: 6.6224 4.5549 0.0053
dipole: 8.0376
quadrupole: -70.8832 -63.5297 -63.5333
quadrupole: -2.6855 -0.0140 0.0185
quadrupole: -4.9011 2.4523 2.4488 -2.6855 -0.0140 0.0185
hfenergy: -547.9685134 hartree
pointgroup: C01 [X(C6H9N3O2)]
dipole: 2.6005836 1.7984936 0.0461475 debye
dipolederiv: -0.723324 -0.2574896 -0.0116055 -0.4304844 -0.7175791 -0.0002682 -0.0062632 0.0065592 -0.2063205 -0.8071519 0.1502572 -0.0261611 0.3901147 -0.7564358 0.0306443 -0.0326381 0.022533 -0.2610389 0.1335164 0.3253924 -0.0015644 0.3151955 -0.6024745 0.0260853 -0.0017815 0.0340425 -0.0827218 0.2187125 0.24049 0.0093637 -0.1692941 -0.4923648 0.0016649 0.0210655 0.0179701 -0.2056839 2.1108057 0.1507832 0.068787 0.1044234 1.1882878 -0.0278951 0.0697662 -0.0265213 0.1950079 -0.0606277 -0.1375209 0.0023145 0.7623486 0.3006301 0.0188424 -0.0294341 -0.0191193 -0.0151775 0.021995 -0.3189189 0.0118343 -0.9064651 0.05814 -0.038206 0.0307646 -0.0161383 -0.0548934 -1.0864304 -0.0884608 -0.0413459 0.0572046 0.4241572 -0.0069144 -0.04487 -0.0132027 0.0882959 -0.0349839 -0.0204782 -0.0046255 -0.186753 -0.0411438 -0.0031207 0.006531 0.0058459 0.0875574 0.016217 -0.1357606 -0.0065138 -0.0346214 0.3554772 -0.0023157 -0.0114917 -0.0103874 0.2145951 -0.1279839 0.0762106 -0.0105706 0.0789619 -0.0166536 0.0062744 -0.0104338 0.0066109 0.0855859 0.0444333 -0.0104353 0.0438934 -0.0528284 -0.011725 -0.0972357 -0.0143694 -0.1231152 -0.0197703 -0.0380916 0.0535969 -0.0097263 0.12796 0.0585251 0.008963 -0.0134105 0.0048753 0.1170628 0.0452571 -0.0262703 -0.0339928 -0.0613394 0.0058426 0.0897376 0.0249035 0.118664 -0.0394219 0.0956933 -0.0537891 -0.089931 0.0066311 -0.0265357 -0.0348552 -0.0530319 -0.0948043 -0.0470684 0.0777106 -0.0636101 0.1095089 0.0041277 -0.0191674 0.0344265 0.0689609 0.0867345 -0.0322649 0.0549791 0.131233 -0.0110875 -0.0365322 0.1940902 -0.0049379 -0.0040913 0.0022401 0.1395103 -0.0042045 0.0407044 -0.0933948 0.0114721 0.0739742 -0.0615742 -0.1231959 -0.0106255 -0.0504531 0.0839756 -0.1017751 0.0015944 0.0047858 -0.0532376 0.0056544 -0.0017584 0.0015445 0.1251551 -0.0204977 0.0458412 0.093223 0.0150925 0.0781928 0.0550306 0.1247778 0.0062941 -0.037956 unknown
polarizability: 142.8124673|3.7984203|108.9240774|3.2540579|-1.5641538|51.8884576 unknown
InChI: InChI=1S/C6H9N3O2/c1-4-5(2)8(3)6(7-4)9(10)11/h1-3H3
charge 0 multiplicity 1
20 atoms
O  -2.65535 -1.510443 -0.096102
O  -2.781076 0.771925 -0.174089
N  0.091324 0.910497 -0.067533
N  0.119653 -1.373092 0.003684
N  -2.106137 -0.347855 -0.112651
C  1.432643 0.512729 -0.004672
C  1.425432 -0.903925 0.038341
C  -0.66243 -0.274248 -0.059414
C  2.573023 1.483482 0.007737
C  -0.330103 2.325908 -0.121418
C  2.599079 -1.839615 0.111583
H  2.520133 2.178028 0.867742
H  3.524712 0.933394 0.077151
H  2.605647 2.100257 -0.910764
H  0.003933 2.85086 0.790527
H  0.119105 2.815262 -1.002929
H  -1.423673 2.365593 -0.19088
H  3.203038 -1.673102 1.022793
H  2.229124 -2.876658 0.129332
H  3.271225 -1.727997 -0.759336
