program: Gaussian 09
title: 000201592
version: EM64L-G09RevD.01
frameworkgroup: C1[X(C18H21NO)]
method: RPBEPBE
basis: SDD
operation: Freq
keyword: #p
keyword: freq=noraman
keyword: PBEPBE/SDD
title: #p freq=noraman PBEPBE/SDD
converged: YES YES NO NO
title: Mulliken charges:
elementType: O N C C C C C C C C C C C C C C C C C C H H H H H H H H H H H H H H H H H H H H H
charge: -0.316368 -0.055629 0.019997 -0.507845 -0.448656 -0.433621 -0.279463 -0.633771 0.368322 0.472643 -0.387994 -0.453216 -0.423699 -0.353036 -0.230089 -0.224800 -0.218773 -0.228915 -0.248102 -0.242627 0.237171 0.243477 0.217375 0.247616 0.201412 0.230223 0.227394 0.207748 0.191058 0.231498 0.226118 0.243901 0.233646 0.276020 0.256347 0.223674 0.226542 0.223333 0.226589 0.225924 0.228576
chargesum: 0.00000
title: Mulliken charges with hydrogens summed into heavy atoms:
elementType: O N C C C C C C C C C C C C C C C C C C
charge: -0.316368 -0.055629 0.257168 -0.046992 0.000372 0.023997 -0.071716 0.014903 0.368322 0.472643 -0.144092 -0.219571 -0.147679 -0.096689 -0.006415 0.001742 0.004560 -0.002326 -0.022178 -0.014052
polarizability: 2.06437288e+02 2.88816692e+00 2.22928507e+02 -3.02399203e-01 -1.55800684e+01 1.55170105e+02
1716.lowfreq: -18.5431 -8.8191 -3.8482 -0.0006 -0.0005 -0.0003 6.8104 20.8790 29.4471
frequency: -16.0734 20.5234 29.3940 34.6835 49.3137 59.1663 84.1005 137.8819 151.4718 202.5864 208.5634 215.8867 266.9184 299.6661 317.1827 355.0362 383.0495 402.1357 403.8618 437.8945 453.6333 467.9512 543.3479 597.7886 601.5265 615.5703 616.1406 648.7966 662.2103 704.7354 705.4670 741.0540 762.5143 779.9702 819.6187 829.9746 845.1884 855.5217 860.8485 873.5152 902.7603 915.7157 930.9882 940.5493 959.3538 977.5268 984.7495 988.8766 990.5967 991.3710 997.4109 999.5461 1012.9796 1025.0810 1027.4498 1050.7364 1053.9987 1078.9288 1079.8517 1083.3159 1117.0557 1165.1492 1169.7066 1170.1743 1171.9948 1179.5597 1184.0798 1189.1830 1212.5268 1223.6733 1251.1147 1267.7375 1278.6223 1292.6470 1299.3044 1310.8095 1316.5105 1318.2467 1335.3105 1343.0084 1381.8418 1386.4085 1425.7410 1433.8712 1442.3910 1445.8798 1450.0207 1469.8669 1470.6824 1479.0359 1479.6176 1481.1182 1591.0028 1594.3371 1610.3279 1614.1494 2863.5799 2914.6914 2979.6155 2996.4739 2998.5765 3020.1114 3025.4544 3060.3126 3076.8483 3082.9449 3094.6176 3109.5241 3119.4908 3125.1714 3127.9941 3137.0628 3140.9477 3148.7451 3157.6626 3163.3968 3176.2452
redmass: 3.5826 3.7358 3.7564 2.6629 4.4931 4.7495 3.7777 4.3993 2.8192 1.6226 2.3840 2.8205 4.4196 3.7135 3.4047 3.0597 2.1955 2.8126 2.8573 2.4807 3.1996 3.3800 3.4547 3.6417 4.8122 6.3376 6.4191 4.8814 2.8181 2.1142 1.6753 1.7561 2.2906 2.8612 3.5197 3.5866 2.3866 1.2531 1.2484 2.8396 2.3833 2.4175 1.8648 1.6217 1.9896 1.3925 1.3899 5.3420 6.2279 4.5102 1.3789 1.3273 1.9546 2.2153 2.1328 2.1850 1.9367 1.6697 1.8058 1.6723 1.4205 1.5869 1.2323 1.1820 1.0699 1.6997 1.1157 1.5096 1.9041 1.4623 1.5859 1.6099 1.2969 1.3462 1.3906 1.2856 1.3368 1.4121 1.2985 1.3548 8.3233 6.5193 1.1500 2.2160 2.1295 1.0832 1.0902 1.0657 1.0794 1.0591 2.2255 2.3084 6.2551 6.1470 6.0714 6.1121 1.0557 1.0817 1.0630 1.0730 1.0734 1.0683 1.0734 1.1013 1.1008 1.1005 1.1028 1.0880 1.0847 1.0858 1.0883 1.0910 1.0940 1.0958 1.0989 1.1014 1.0955
irintensity: 0.2831 0.0062 0.0758 0.6546 0.7163 0.3136 0.4199 1.3676 1.3006 0.6085 1.0604 3.2429 1.0711 0.7588 10.9585 3.1719 0.7831 0.1321 0.3003 4.1772 4.9783 1.4178 2.1253 23.2039 13.0543 2.6546 0.0362 9.3744 11.4099 39.3403 54.7012 64.7080 33.1254 19.6836 14.1906 4.2935 2.7146 0.1771 0.2343 3.1601 12.8699 3.4107 9.9707 1.4585 6.8000 0.3458 3.6994 68.8809 0.5948 82.2445 6.6415 2.1538 10.2539 4.0317 11.5029 30.3337 2.2334 22.0610 13.5404 2.2294 18.8274 4.7307 8.0445 11.7861 1.2098 10.0480 3.2147 5.4084 4.1421 1.2069 2.1102 8.9093 13.8139 6.8289 27.4424 1.0498 5.4983 1.1739 3.0097 4.3547 0.8646 0.4734 1.5282 12.1678 13.5872 14.8530 5.5936 17.8585 16.8315 3.0167 6.5126 26.2109 0.9782 0.3201 3.6641 5.6981 112.7823 28.8384 52.2016 45.8018 4.2302 26.8821 61.3868 22.0983 17.1049 48.5277 36.6527 9.7470 1.9160 0.0168 4.6853 16.5212 34.4298 31.3476 33.1978 24.5995 9.0054
temp: 298.150 k
press: 1.00000 atm
elementType: 8 7 6 6 6 6 6 6 6 6 6 6 6 6 6 6 6 6 6 6 1 1 1 1 1 1 1 1 1 1 1 1 1 1 1 1 1 1 1 1 1
symmnumber: 1
zpe: 903830.4 jmol-1
zpe.correction: 0.344251 hartree
zpe.thermalcorrener: 0.361558 hartree
zpe.thermalcorrenthalpy: 0.362502 hartree
zpe.thermalcorrgfe: 0.296602 hartree
zpe.sumelectzpe: -826.992151 hartree
zpe.sumelectthermal: -826.974844 hartree
zpe.sumelectthermalent: -826.973900 hartree
zpe.sumelectthermalfe: -827.039800 hartree
dipole: 0.4372 2.2149 0.0362
dipole: 2.2579
quadrupole: -113.5629 -113.0013 -116.1638
quadrupole: 3.6085 2.9009 -5.0350
quadrupole: 0.6798 1.2413 -1.9211 3.6085 2.9009 -5.0350
hfenergy: -827.3364014 hartree
pointgroup: C01 [X(C18H21N1O1)]
dipole: -0.0617072 0.8421852 -0.275785 debye
polarizability: 206.0363808|-0.0732595|206.712431|4.490472|-32.8741172|171.7870881 unknown
InChI: InChI=1S/C18H21NO/c1-19-13-12-17(14-19)20-18(15-8-4-2-5-9-15)16-10-6-3-7-11-16/h2-11,17-18H,12-14H2,1H3
charge 0 multiplicity 1
41 atoms
O  0.909198 -0.218908 0.561648
N  4.24087 -0.186165 -0.600298
C  1.988401 0.647741 0.031556
C  2.990386 0.871795 1.186632
C  2.829563 -0.094608 -1.079647
C  4.121777 -0.156957 0.888661
C  -0.239489 -0.382243 -0.355906
C  5.127956 0.871242 -1.143128
C  -1.10139 -1.521582 0.200324
C  -0.998785 0.934728 -0.529834
C  -2.420147 -1.710342 -0.285972
C  -1.138164 1.526923 -1.807461
C  -0.581065 -2.432709 1.151168
C  -1.557045 1.588875 0.59815
C  -3.204409 -2.79342 0.16739
C  -1.83167 2.750516 -1.964355
C  -1.369626 -3.512724 1.610172
C  -2.244868 2.810882 0.446872
C  -2.681625 -3.700283 1.11882
C  -2.386486 3.395161 -0.836139
H  1.538658 1.591789 -0.33042
H  2.496333 0.722551 2.160744
H  3.390166 1.901697 1.150851
H  2.415531 -1.116162 -1.191166
H  2.791825 0.4096 -2.061399
H  5.090875 0.095015 1.351052
H  3.818307 -1.16087 1.241464
H  0.137516 -0.694648 -1.357314
H  4.820547 1.917997 -0.895903
H  5.172481 0.78062 -2.242673
H  6.15045 0.716561 -0.75537
H  -2.837177 -1.003145 -1.012694
H  -0.705029 1.028613 -2.684811
H  0.434091 -2.278243 1.525702
H  -1.442555 1.131661 1.587378
H  -4.222082 -2.926759 -0.217047
H  -1.935392 3.198113 -2.959264
H  -0.957801 -4.208976 2.349975
H  -2.673494 3.309132 1.323905
H  -3.290423 -4.539617 1.473864
H  -2.923505 4.343349 -0.952626
