program: Gaussian 09
title: 000201644
version: EM64L-G09RevD.01
frameworkgroup: C1[X(C20H22N2O4)]
method: RPBEPBE
basis: SDD
operation: Freq
keyword: #p
keyword: freq=noraman
keyword: PBEPBE/SDD
title: #p freq=noraman PBEPBE/SDD
converged: YES YES NO NO
title: Mulliken charges:
elementType: O O O O N N C C C C C C C C C C C C C C C C C C C C H H H H H H H H H H H H H H H H H H H H H H
charge: -0.266632 -0.315461 -0.417313 -0.228443 -0.379094 -0.352032 -0.194913 -0.470814 -0.471170 0.218424 0.253126 -0.564402 -0.648186 0.486294 0.403126 0.177202 -0.366106 -0.418675 -0.359362 -0.411673 -0.241539 -0.220232 -0.224952 -0.220638 -0.243771 -0.240635 0.268826 0.254953 0.252442 0.256135 0.253658 0.344662 0.354953 0.255945 0.225475 0.247743 0.255209 0.269570 0.230963 0.256587 0.238136 0.223698 0.226556 0.230288 0.231274 0.229987 0.233148 0.377666
chargesum: 0.00000
title: Mulliken charges with hydrogens summed into heavy atoms:
elementType: O O O O N N C C C C C C C C C C C C C C C C C C C C
charge: -0.266632 -0.315461 -0.039646 -0.228443 -0.034432 0.002921 0.073913 0.036580 0.038623 0.218424 0.253126 -0.082983 -0.145234 0.486294 0.403126 0.177202 -0.096536 -0.187712 -0.102775 -0.173538 -0.017841 0.006323 0.005336 0.010635 -0.013784 -0.007487
polarizability: 2.62215110e+02 -2.13779546e+00 2.15787206e+02 1.44549478e+01 -2.97744866e+01 2.06560718e+02
1716.lowfreq: -19.4961 -8.7375 -5.2392 -3.4230 -0.0010 -0.0008 -0.0006 8.7482 12.3946
frequency: -15.9412 7.6490 11.5584 17.1466 22.0283 25.1457 37.2852 47.7574 64.6340 67.6006 76.8168 94.1769 110.5022 158.1776 170.5736 191.1058 214.6436 236.6113 265.1297 270.1278 305.8919 314.9655 328.3885 369.2552 399.8576 402.4427 402.5040 425.1951 468.0289 474.8984 513.2788 520.4114 559.4102 582.2661 591.5474 608.9495 614.7651 616.7671 619.5220 638.0860 652.5576 670.2880 706.3566 707.6837 741.2501 757.7250 761.8624 770.3567 800.5544 818.7953 827.5839 846.5622 857.1194 860.4295 903.2566 908.1401 918.8641 925.2772 930.2561 964.6083 980.8667 982.8080 988.9919 989.6395 995.6880 1000.5501 1002.4283 1018.6957 1025.1875 1026.8521 1042.7549 1077.8521 1083.3892 1087.2600 1094.1674 1120.7258 1171.6192 1171.9748 1173.1826 1177.6668 1188.3220 1190.2155 1206.4691 1210.3388 1225.9029 1234.2624 1242.3446 1248.1703 1266.2462 1287.0862 1290.0850 1318.4538 1328.1733 1328.5247 1335.4179 1348.5419 1376.1332 1380.2572 1382.6040 1439.3740 1439.5570 1440.9141 1445.4755 1459.2222 1465.1323 1481.9214 1484.5492 1486.4514 1523.2317 1576.6143 1591.4060 1592.8606 1611.9253 1613.7445 1626.6816 1668.6011 2981.6506 3002.6452 3004.9548 3012.0101 3024.9515 3054.4818 3063.8111 3072.6067 3087.8366 3116.5275 3119.1913 3119.8037 3120.5897 3135.2639 3136.0550 3144.1898 3148.2160 3160.9678 3166.1404 3345.3982 3505.3121 3508.9515
redmass: 4.7979 4.8842 5.9923 8.3787 5.9497 3.9852 4.4827 5.8521 7.7095 6.0822 3.7904 2.8890 4.8265 5.1593 4.4713 4.9559 6.2951 6.2264 3.9174 6.0098 3.6793 2.2571 4.5281 4.4154 3.0809 2.8247 2.8205 3.8493 3.7215 3.6502 2.0663 4.0950 3.8247 4.3841 4.0140 3.0888 4.6042 3.8034 3.7306 1.6570 1.4707 3.6573 1.7588 1.7800 3.9631 1.9949 1.8586 1.7403 1.5649 2.3387 3.6427 2.9952 1.2484 1.2496 3.7835 2.8185 1.8176 1.4651 1.6716 3.1158 1.3948 1.3964 5.7868 5.9641 1.4217 1.3661 2.0189 3.1226 2.2722 2.2010 3.3763 2.1515 1.5985 1.6608 2.6248 2.7018 1.0671 1.2998 1.2048 1.1133 1.1300 1.1287 2.4686 2.1844 1.8148 1.5802 1.5428 1.3021 1.7307 1.3422 1.4896 1.3648 1.2748 1.2722 1.7102 1.3020 1.8598 8.1235 7.1968 1.8541 2.1231 1.1686 1.1861 1.1387 1.2495 2.1403 2.3035 1.5533 1.7382 6.3223 5.9931 6.0098 5.9438 6.0964 5.4720 8.3268 1.0653 1.0828 1.0622 1.0592 1.0634 1.0937 1.0987 1.1040 1.1008 1.0857 1.0882 1.0879 1.0875 1.0919 1.0906 1.0964 1.0957 1.1015 1.1014 1.0829 1.0777 1.0639
irintensity: 0.0538 0.2360 0.4053 1.0328 0.0958 0.0450 0.2363 0.7436 4.6209 4.4655 1.1780 6.1406 5.1736 0.9765 1.3818 1.8459 4.2730 7.8255 4.4520 10.2875 1.5252 0.5990 1.2062 18.5693 10.7464 0.0662 0.0029 25.3223 9.6555 35.7046 34.3131 6.9148 31.7664 6.8939 30.7326 28.9391 7.9061 20.5077 12.3120 32.6444 125.2557 5.9007 68.3090 49.3434 1.2818 44.2720 19.0446 13.1879 82.2721 79.0701 8.4671 23.2053 1.3875 0.4407 1.6951 1.3795 5.9017 3.9653 2.5385 0.9898 0.3057 0.2420 0.1176 0.2768 0.6819 0.4238 2.5986 102.4822 4.1382 4.9528 118.1396 44.2991 12.8471 20.7084 15.6046 41.1484 0.2605 1.5536 0.5163 2.1736 0.5770 2.2006 4.4369 1.3445 13.2499 31.0410 25.9095 3.5566 64.5148 20.3603 4.0976 11.6204 1.5196 6.1319 25.3095 8.1593 38.9823 0.2028 1.4290 8.3939 20.6725 11.4920 80.4183 17.5372 82.7181 6.7506 13.8201 91.4644 277.2250 130.9667 2.6006 2.1615 7.3545 0.4822 212.7647 202.9788 10.6328 6.8397 11.4992 41.9613 5.2895 2.5823 3.0068 5.5878 18.5666 6.7857 5.3739 3.6235 0.8333 13.2864 7.5131 31.5669 28.4070 23.3774 19.9835 158.1254 38.2483 23.3874
temp: 298.150 k
press: 1.00000 atm
elementType: 8 8 8 8 7 7 6 6 6 6 6 6 6 6 6 6 6 6 6 6 6 6 6 6 6 6 1 1 1 1 1 1 1 1 1 1 1 1 1 1 1 1 1 1 1 1 1 1
symmnumber: 1
zpe: 1009371.2 jmol-1
zpe.correction: 0.384449 hartree
zpe.thermalcorrener: 0.408542 hartree
zpe.thermalcorrenthalpy: 0.409486 hartree
zpe.thermalcorrgfe: 0.323695 hartree
zpe.sumelectzpe: -1183.885501 hartree
zpe.sumelectthermal: -1183.861408 hartree
zpe.sumelectthermalent: -1183.860464 hartree
zpe.sumelectthermalfe: -1183.946255 hartree
dipole: -0.5002 3.0015 1.8579
dipole: 3.5653
quadrupole: -133.4961 -145.6605 -165.8467
quadrupole: -1.8910 -4.1688 -9.8472
quadrupole: 14.8384 2.6739 -17.5123 -1.8910 -4.1688 -9.8472
hfenergy: -1184.2699503 hartree
pointgroup: C01 [X(C20H22N2O4)]
dipole: 0.4125929 -1.2638886 -0.4471124 debye
polarizability: 246.083257|17.6478838|211.3770477|-5.0612435|-36.7510584|227.1027291 unknown
InChI: InChI=1S/C20H22N2O4/c23-18(13-15-7-3-1-4-8-15)22-17(11-12-19(24)25)20(26)21-14-16-9-5-2-6-10-16/h1-10,17,21-22,24H,11-14H2
charge 0 multiplicity 1
48 atoms
O  -1.25341 2.497069 1.13255
O  -0.617199 -0.013902 -2.690841
O  -5.93538 -2.051402 1.171421
O  -4.503889 -1.270699 2.823409
N  -1.06216 -0.504234 -0.466934
N  -0.567342 2.411856 -1.103716
C  -2.024906 0.610826 -0.294109
C  -3.027445 0.29068 0.827286
C  -3.975507 -0.860039 0.435786
C  -1.252677 1.936516 -0.00715
C  -0.418382 -0.742475 -1.65962
C  0.347117 3.568281 -1.011522
C  0.540025 -1.946605 -1.710711
C  1.806189 3.151146 -0.831273
C  0.997069 -2.489746 -0.365935
C  -4.783898 -1.376714 1.609786
C  2.221989 2.532473 0.377903
C  2.758231 3.357061 -1.859184
C  1.971315 -1.788079 0.394868
C  0.455845 -3.68992 0.162997
C  3.56332 2.125716 0.548927
C  4.102851 2.95062 -1.68959
C  2.392229 -2.276508 1.651304
C  0.875795 -4.180686 1.421254
C  4.508789 2.332581 -0.485063
C  1.845286 -3.474462 2.16931
H  -2.543565 0.723712 -1.266288
H  -2.491313 0.04751 1.762602
H  -3.603204 1.204999 1.051545
H  -4.67086 -0.564196 -0.369912
H  -3.396599 -1.719543 0.038601
H  -0.773522 -1.030408 0.363754
H  -0.563773 1.823958 -1.95413
H  0.007941 4.166013 -0.146543
H  0.232507 4.179212 -1.9250
H  0.027717 -2.731449 -2.299237
H  1.398918 -1.614071 -2.320572
H  1.490164 2.383903 1.180917
H  2.447729 3.834748 -2.797055
H  2.402187 -0.859151 -0.000111
H  -0.290476 -4.247302 -0.416842
H  3.87624 1.66192 1.491925
H  4.829487 3.11674 -2.492949
H  3.146008 -1.725555 2.224715
H  0.450322 -5.110907 1.813807
H  5.550751 2.020878 -0.350286
H  2.17219 -3.853509 3.143777
H  -6.427507 -2.403554 1.962731
