program: Gaussian 09
title: 000201564
version: EM64L-G09RevD.01
frameworkgroup: C1[X(C20H30N2)]
method: RPBEPBE
basis: SDD
operation: Freq
keyword: #p
keyword: freq=noraman
keyword: PBEPBE/SDD
title: #p freq=noraman PBEPBE/SDD
converged: YES YES NO NO
title: Mulliken charges:
elementType: N N C C C C C C C C C C C C C C C C C C C C H H H H H H H H H H H H H H H H H H H H H H H H H H H H H H
charge: -0.047202 -0.047202 -0.387848 -0.387842 -0.393324 -0.393329 -0.369356 -0.369353 -0.367789 -0.367791 -0.421540 -0.421540 -0.112542 -0.110115 -0.110111 -0.112538 -0.175240 -0.176958 -0.176961 -0.175242 -0.132506 -0.132506 0.205659 0.205942 0.205663 0.205935 0.209687 0.208828 0.208835 0.209682 0.212355 0.213708 0.213702 0.212359 0.229631 0.230686 0.229635 0.230684 0.257523 0.259495 0.257526 0.259493 0.293861 0.294536 0.294537 0.293862 0.287278 0.287163 0.287162 0.287277 0.298065 0.298066
chargesum: 2.00000
title: Mulliken charges with hydrogens summed into heavy atoms:
elementType: N N C C C C C C C C C C C C C C C C C C C C
charge: -0.047202 -0.047202 0.023753 0.023756 0.025191 0.025189 0.056707 0.056709 0.092529 0.092528 0.095479 0.095478 0.181319 0.184421 0.184426 0.181324 0.112038 0.110204 0.110201 0.112034 0.165559 0.165559
polarizability: 3.19171443e+02 -2.42829013e+00 2.01429843e+02 3.90351014e+01 2.27710561e+00 1.50287454e+02
1716.lowfreq: -14.9852 -13.5860 -3.8738 -0.0020 0.0009 0.0016 2.1062 8.7411 18.2938
frequency: -13.5862 8.7411 18.0224 18.2939 42.4714 43.2588 49.5224 76.7638 82.5451 90.2245 112.6679 117.4731 128.0881 149.1510 151.8621 155.9594 200.2259 245.8322 274.8833 356.1894 359.9305 370.9923 371.3569 394.0133 394.0158 449.1869 456.3791 497.4890 506.9323 588.1811 591.7945 642.5917 642.5951 690.3971 690.5344 725.3194 731.5689 743.4082 761.8423 775.3224 775.6298 790.8988 798.5939 798.6949 840.6834 863.2166 863.7949 903.3437 951.2369 951.5398 967.5175 978.7819 987.5575 987.6864 988.4838 1010.5171 1015.4561 1017.2805 1023.9915 1025.2333 1025.2855 1033.6763 1050.1795 1051.2122 1051.7969 1059.7429 1071.6323 1073.1815 1074.2285 1077.1934 1096.4048 1147.8820 1148.0737 1154.7014 1159.7944 1185.9830 1187.8022 1200.6375 1213.6293 1219.9533 1220.1882 1229.6171 1246.8505 1256.6701 1275.0977 1276.8838 1283.5904 1293.0139 1295.0385 1305.0636 1305.7776 1306.0868 1332.6636 1345.3033 1349.0421 1354.7228 1355.6845 1355.6850 1361.5353 1361.6133 1377.0026 1377.0074 1459.2280 1459.5308 1462.8610 1463.4682 1466.8525 1467.9985 1472.7059 1476.6289 1476.6473 1478.2685 1484.0979 1488.5399 1500.7179 1500.7560 1572.8993 1572.9053 1624.9848 1624.9901 2958.5313 2959.8831 2962.6051 2964.9889 2969.9459 2973.8448 2984.3934 2984.5877 2994.9855 3001.5792 3009.0519 3019.2584 3031.4283 3031.8939 3031.9154 3041.9563 3051.1692 3054.7873 3101.0213 3101.0343 3178.1977 3178.2027 3186.2502 3186.2537 3192.1068 3192.1121 3201.8510 3201.8544 3208.7775 3208.7811
redmass: 3.5899 4.5743 3.7463 4.8541 3.4180 4.1684 1.9931 2.6508 3.9103 1.9650 4.9880 2.2791 1.9402 4.2589 2.1652 2.0003 3.9654 4.5772 3.6289 3.8792 3.4035 2.4161 2.4384 2.6791 2.6791 3.5521 3.3912 3.7302 3.2745 5.1671 4.7521 6.3378 6.3375 1.8998 1.8969 1.0617 1.0747 1.0885 1.1222 1.8950 1.8635 1.1888 3.5270 3.3845 1.2491 1.2667 1.2662 1.2752 1.3719 1.3673 1.2577 5.1079 1.3966 1.3962 4.8323 4.5084 5.1755 4.8524 1.1851 1.3734 1.3701 3.8130 3.3710 2.4073 2.7277 2.8479 1.6620 2.5289 1.5630 2.2651 5.3953 4.4880 4.5102 1.5474 1.3675 1.1352 1.0834 1.4245 1.2297 1.1733 1.1776 1.4016 1.2718 1.3403 1.2365 1.2658 1.0779 1.0955 1.0919 1.1067 1.1065 1.2732 1.2753 1.2812 1.3502 1.4701 1.4785 1.4789 1.4925 1.5599 2.6127 2.6123 1.2415 1.2553 1.1106 1.1059 1.0648 1.1443 1.1977 2.2530 2.2448 1.1934 1.1578 1.1230 1.2445 1.2418 5.8309 5.8313 5.0571 5.0579 1.0591 1.0590 1.0593 1.0594 1.0593 1.0586 1.0589 1.0588 1.0977 1.0993 1.1014 1.1035 1.1022 1.0595 1.0618 1.1052 1.1052 1.1049 1.1077 1.1077 1.0909 1.0909 1.0906 1.0906 1.0958 1.0958 1.0990 1.0990 1.1037 1.1037
irintensity: 0.1159 1.5522 0.0003 2.4998 1.9196 0.0000 0.0000 0.0000 1.3059 0.1624 0.0000 0.1415 0.0000 0.0000 0.0000 0.0090 1.7973 0.8039 0.0000 0.0000 0.2674 0.0000 0.0668 0.0135 0.0156 0.0000 3.6478 20.0217 0.0000 0.0000 3.1734 0.0020 0.2053 0.0014 122.3653 15.8055 0.0000 6.4722 0.0000 96.8032 0.0001 0.4822 0.0001 22.0001 0.0000 0.0029 0.0000 0.0470 0.0000 2.7350 0.0000 1.4309 0.0094 0.0000 0.0000 0.0000 7.8901 0.0000 0.4435 0.3123 0.0001 2.7787 0.7154 0.0000 8.3615 0.0000 0.0000 0.2462 5.9956 0.0000 0.0000 70.1554 0.0001 0.0000 4.9453 0.0000 0.8221 0.0000 48.6472 0.0000 0.4732 0.4440 0.0000 0.0000 0.5077 1.2927 0.0000 0.0000 2.1248 0.0402 0.0000 0.0000 1.0147 0.0000 3.1728 0.0000 2.0864 0.8485 0.0627 0.0000 0.8122 0.0071 7.3038 0.0000 0.0000 2.1798 0.0000 10.0233 0.0000 0.0248 103.3891 16.3048 0.0000 37.4955 0.0328 39.8599 0.0286 1.0556 46.5224 0.2126 0.0000 0.6471 0.0000 0.6018 0.0000 108.0790 0.0008 87.4597 0.0000 0.2132 0.0000 0.3244 0.0001 22.0516 0.2455 7.2584 0.0000 179.6422 0.8228 18.4978 0.0574 0.0552 0.0886 0.1437 1.6033 1.3118 2.8552 5.1973 1.2241 0.6992
temp: 298.150 k
press: 1.00000 atm
elementType: 7 7 6 6 6 6 6 6 6 6 6 6 6 6 6 6 6 6 6 6 6 6 1 1 1 1 1 1 1 1 1 1 1 1 1 1 1 1 1 1 1 1 1 1 1 1 1 1 1 1 1 1
symmnumber: 1
zpe: 1211880.6 jmol-1
zpe.correction: 0.461581 hartree
zpe.thermalcorrener: 0.483638 hartree
zpe.thermalcorrenthalpy: 0.484582 hartree
zpe.thermalcorrgfe: 0.404827 hartree
zpe.sumelectzpe: -887.453066 hartree
zpe.sumelectthermal: -887.431010 hartree
zpe.sumelectthermalent: -887.430065 hartree
zpe.sumelectthermalfe: -887.509820 hartree
dipole: 0.0000 0.0007 -0.0001
dipole: 0.0007
quadrupole: 434.2161 -102.9606 -125.3007
quadrupole: -0.5343 8.8513 1.0892
quadrupole: 365.5645 -171.6122 -193.9523 -0.5343 8.8513 1.0892
hfenergy: -887.9146471 hartree
pointgroup: C01 [X(C20H30N2)]
dipole: -0.0000036 0.0002665 0.0001044 debye
polarizability: 319.2774836|-5.7717306|200.1938522|38.4509147|8.181097|151.4174042 unknown
InChI: InChI=1S/C20H30N2/c1(3-5-9-15-21-17-11-7-12-18-21)2-4-6-10-16-22-19-13-8-14-20-22/h7-8,11-14,17-20H,1-6,9-10,15-16H2
charge 2 multiplicity 1
52 atoms
N  7.035344 0.065457 -0.49323
N  -7.033885 -0.028466 0.496922
C  0.589857 0.07388 -0.496382
C  -0.588403 -0.03743 0.499859
C  1.972249 -0.019227 0.192168
C  -1.970801 0.05573 -0.188671
C  3.146632 0.095797 -0.80949
C  -3.145165 -0.059244 0.813015
C  4.527448 0.007626 -0.113785
C  -4.525998 0.029075 0.117362
C  5.674269 0.134422 -1.142559
C  -5.672788 -0.097643 1.146182
C  7.66254 -1.15086 -0.349468
C  -7.611595 -1.178422 0.009767
C  7.612822 1.215502 -0.006008
C  -7.66087 1.18796 0.353155
C  8.90716 -1.241651 0.290053
C  -8.854891 -1.135173 -0.636764
C  8.85609 1.172457 0.640588
C  -8.905506 1.278956 -0.286303
C  9.517769 -0.068864 0.793482
C  -9.516354 0.106263 -0.789664
H  0.516521 1.035724 -1.044588
H  0.503601 -0.728552 -1.257691
H  -0.515084 -0.999288 1.048046
H  -0.502123 0.764983 1.261185
H  2.046298 -0.981784 0.73846
H  2.05738 0.782731 0.953797
H  -2.05598 -0.746223 -0.950301
H  -2.044821 1.018291 -0.734957
H  3.065733 1.057538 -1.356311
H  3.059043 -0.708195 -1.568522
H  -3.057488 0.74471 1.572076
H  -3.064326 -1.021014 1.359795
H  4.613625 0.811743 0.643335
H  4.612955 -0.956702 0.424382
H  -4.612283 -0.77501 -0.63978
H  -4.611436 0.993428 -0.42077
H  5.621232 -0.67576 -1.890119
H  5.612114 1.096307 -1.680619
H  -5.619613 0.712489 1.893787
H  -5.610726 -1.059567 1.68418
H  7.147033 -2.020302 -0.76317
H  -7.058114 -2.107421 0.162923
H  7.059181 2.144406 -0.159164
H  -7.145185 2.057321 0.766803
H  9.38744 -2.218363 0.383651
H  -9.295197 -2.063935 -1.006776
H  9.29621 2.101287 1.010653
H  -9.385616 2.255752 -0.379906
H  10.49058 -0.120587 1.290518
H  -10.489181 0.158144 -1.28665
