program: Gaussian 09
title: 000201607
version: EM64L-G09RevD.01
frameworkgroup: C1[X(C16H22N2O3)]
method: RPBEPBE
basis: SDD
operation: Freq
keyword: #p
keyword: freq=noraman
keyword: PBEPBE/SDD
title: #p freq=noraman PBEPBE/SDD
converged: YES YES NO NO
title: Mulliken charges:
elementType: O O O N N C C C C C C C C C C C C C C C C H H H H H H H H H H H H H H H H H H H H H H
charge: -0.230850 -0.255096 -0.267059 -0.370795 -0.457154 -0.015571 -0.403362 -0.712001 -0.685133 0.193135 0.140671 0.186055 -0.506201 0.506097 -0.333549 -0.480675 -0.347407 0.216111 -0.061429 -0.780455 -0.556917 0.191978 0.214692 0.250649 0.225879 0.205226 0.219294 0.205818 0.223796 0.221305 0.318657 0.325922 0.246485 0.220737 0.302952 0.216408 0.209597 0.253427 0.258156 0.259228 0.211997 0.223752 0.215631
chargesum: 0.00000
title: Mulliken charges with hydrogens summed into heavy atoms:
elementType: O O O N N C C C C C C C C C C C C C C C C
charge: -0.230850 -0.255096 -0.267059 -0.052138 -0.154202 0.176406 0.061979 -0.061602 -0.034213 0.193135 0.140671 0.186055 -0.180279 0.506097 -0.087064 -0.259939 0.078597 0.216111 0.191998 -0.051074 -0.117534
polarizability: 2.91447804e+02 -1.18816517e+01 2.21526718e+02 2.33019869e+00 -2.52947570e-01 1.25245921e+02
1716.lowfreq: -7.4076 -4.2087 0.0003 0.0005 0.0009 4.6160 21.9838 22.8789 31.8915
frequency: 21.8676 22.4785 31.8174 49.8713 55.2087 58.6061 61.4762 71.0218 78.4538 91.1350 104.6602 124.1202 128.6328 180.1713 193.6145 220.7204 236.5654 250.0187 254.5649 272.1680 282.6521 332.3111 353.7404 362.8056 365.1855 378.5841 382.8304 413.9564 464.4539 498.4402 521.1771 566.4794 573.5568 601.4220 612.9877 623.7782 636.5519 652.8687 661.2136 707.6015 763.3872 769.0426 781.8264 789.3561 806.9161 891.8844 915.5924 916.5997 922.2142 929.9445 943.1723 948.0755 952.7661 955.1367 969.4637 972.7614 982.7818 993.9851 1007.7711 1016.2771 1039.6268 1081.4598 1128.5468 1146.0017 1147.3523 1161.3804 1189.1058 1211.3805 1215.9365 1220.8214 1241.1250 1257.2384 1263.4467 1282.4950 1287.3050 1303.6772 1329.6816 1341.3060 1356.2197 1380.9993 1381.2444 1389.1104 1398.3459 1406.1672 1432.2717 1448.4297 1450.1636 1462.4785 1463.4436 1470.0046 1476.5105 1478.7017 1482.6474 1484.3564 1493.9350 1511.1888 1590.3284 1598.8713 1617.4452 1625.0924 1666.9828 2938.8832 2962.3745 2965.5227 2980.0143 2988.1233 2994.7338 3006.0332 3057.1670 3065.6837 3068.6256 3075.3211 3083.2099 3091.8937 3095.7285 3098.6874 3115.1196 3131.3623 3166.4113 3180.9939 3202.9661 3536.3005 3552.2629
redmass: 4.1432 4.7364 3.8157 4.3199 3.5065 1.6172 3.0358 2.7438 2.1828 2.7471 3.3201 4.4554 3.4690 4.3431 4.7062 1.1491 3.2238 1.1438 4.2978 4.1865 3.4314 3.9501 5.9322 3.9172 2.1849 2.0598 3.9183 3.2372 3.2977 3.1496 2.9665 1.6075 2.8226 2.7984 1.8916 2.4515 1.2232 4.3984 4.2802 5.5400 4.0509 4.2868 3.3359 4.6256 1.6053 2.2698 1.5304 1.5375 1.4400 3.3495 2.3835 1.4862 1.3625 1.6534 3.2659 2.0612 1.6000 1.9996 2.0066 1.2718 1.6249 2.0020 2.2081 2.0725 1.6627 1.4834 1.9834 2.4357 1.2684 2.5028 1.7269 1.3329 2.1210 1.2469 1.6309 1.6139 1.5448 1.3501 1.3054 1.2395 5.3602 1.2426 1.2333 4.7280 1.1994 1.0453 1.1163 1.1752 1.0851 1.1021 1.0582 1.6138 1.1688 1.5733 1.1347 2.5526 7.1013 7.2416 4.8183 6.1024 4.7952 1.0562 1.0787 1.0376 1.0366 1.0659 1.0362 1.1046 1.0998 1.0987 1.0990 1.0991 1.0997 1.0616 1.0999 1.0986 1.0901 1.0945 1.0932 1.0924 1.1139 1.0765 1.0775
irintensity: 4.5073 0.1365 0.8625 12.4203 0.2295 1.4326 1.6895 1.6948 0.9881 2.9568 1.3087 1.2978 0.7399 2.6133 3.7226 0.8061 2.9847 0.3746 3.8278 3.1631 1.0581 5.0889 1.6676 2.7628 1.0322 2.7070 4.0026 6.4085 2.8870 23.0033 17.4301 45.8650 40.3777 14.7187 15.5561 10.4956 53.3312 0.9900 14.7854 0.6971 6.1594 4.5382 4.8521 8.4255 62.5244 7.7044 5.8343 7.3856 5.7389 6.7349 5.3674 4.9398 118.0274 11.2187 102.3353 7.2249 11.0744 14.7275 13.7059 16.0876 14.2198 51.8358 14.6578 18.1687 3.6709 14.5461 2.1803 47.1566 8.8743 326.5752 41.0771 48.0181 46.0758 4.9317 56.7940 37.5033 16.2978 7.2316 5.3907 32.0945 140.3446 52.8291 15.7369 59.9506 46.1371 15.4997 22.0387 37.5403 20.5865 18.2505 8.5482 117.8507 32.8143 5.8702 54.1832 449.6443 88.7054 106.1066 167.6093 40.5345 4.4767 42.5931 23.1889 25.7784 35.6397 68.5785 15.9287 34.3643 43.5422 3.0145 19.4480 91.1683 33.7947 10.2304 17.1669 10.0796 21.6371 2.9574 14.8080 7.5218 23.2844 11.8664 14.6351
temp: 298.150 k
press: 1.00000 atm
elementType: 8 8 8 7 7 6 6 6 6 6 6 6 6 6 6 6 6 6 6 6 6 1 1 1 1 1 1 1 1 1 1 1 1 1 1 1 1 1 1 1 1 1 1
symmnumber: 1
zpe: 927099.7 jmol-1
zpe.correction: 0.353114 hartree
zpe.thermalcorrener: 0.376285 hartree
zpe.thermalcorrenthalpy: 0.377229 hartree
zpe.thermalcorrgfe: 0.297455 hartree
zpe.sumelectzpe: -956.487886 hartree
zpe.sumelectthermal: -956.464714 hartree
zpe.sumelectthermalent: -956.463770 hartree
zpe.sumelectthermalfe: -956.543544 hartree
dipole: 0.3563 -5.6534 -1.8469
dipole: 5.9581
quadrupole: -115.3128 -98.6697 -129.2003
quadrupole: -0.1081 2.5178 -4.8539
quadrupole: -0.9186 15.7245 -14.8060 -0.1081 2.5178 -4.8539
hfenergy: -956.8409997 hartree
pointgroup: C01 [X(C16H22N2O3)]
dipole: 0.0850979 -2.2338399 -0.7053038 debye
polarizability: 290.8069684|-13.5890754|222.1489763|2.5787804|-1.2456939|125.2644982 unknown
InChI: InChI=1S/C16H22N2O3/c1-5-8-21-15-7-6-13(18-12(4)19)9-14(15)16(20)17-10-11(2)3/h5-7,9,11,17-18H,1,8,10H2,2-4H3
charge 0 multiplicity 1
43 atoms
O  -2.814365 -0.093323 -0.123759
O  -1.119073 2.073013 0.94684
O  3.681344 -1.188544 -0.175039
N  0.471196 2.046072 -0.763035
N  2.099888 -2.909206 0.063127
C  2.105088 3.884055 -0.144343
C  0.72659 3.49457 -0.753441
C  3.281849 3.271209 -0.941855
C  2.186424 3.507471 1.352297
C  -0.417285 -0.082619 0.011402
C  -0.41511 1.429722 0.111317
C  -1.632046 -0.828359 -0.021879
C  0.820246 -0.762749 0.033665
C  0.872544 -2.180594 0.037388
C  -1.58044 -2.244905 0.001492
C  -0.340006 -2.911619 0.031054
C  -4.09543 -0.810537 0.059473
C  3.401641 -2.418948 -0.041397
C  -5.17367 0.236972 0.139484
C  4.493226 -3.485649 0.021639
C  -6.340229 0.177882 -0.547142
H  2.16737 4.990091 -0.232086
H  0.658898 3.875453 -1.791718
H  -0.088172 3.950197 -0.162938
H  3.307122 2.169244 -0.83674
H  3.21685 3.517574 -2.019417
H  4.248994 3.653529 -0.567097
H  3.150507 3.830606 1.786873
H  1.367376 3.973273 1.929082
H  2.106401 2.412576 1.482853
H  0.975317 1.462382 -1.432529
H  1.758199 -0.205671 0.078234
H  -2.49882 -2.837738 -0.024488
H  -0.321748 -4.009061 0.043172
H  2.004252 -3.922981 0.151358
H  -4.041141 -1.392833 1.004932
H  -4.273631 -1.509787 -0.782854
H  -4.961976 1.067793 0.824928
H  5.116081 -3.414306 -0.886458
H  5.149403 -3.275202 0.883929
H  4.110807 -4.517584 0.111233
H  -7.1126 0.944519 -0.42493
H  -6.558769 -0.63499 -1.251228
