program: Gaussian 09
title: 000201599
version: EM64L-G09RevD.01
frameworkgroup: C1[X(C20H30O2)]
method: RPBEPBE
basis: SDD
operation: Freq
keyword: #pfreq=noraman
keyword: PBEPBE/SDD
title: #p freq=noraman PBEPBE/SDD
converged: YES YES NO NO
title: Mulliken charges:
elementType: O O C C C C C C C C C C C C C C C C C C C C H H H H H H H H H H H H H H H H H H H H H H H H H H H H H H
charge: -0.464708 -0.198067 0.379591 -0.137057 -0.096088 0.281617 -0.189161 -0.556403 -0.569388 -0.517841 -0.488632 -0.524762 -0.855315 0.196398 -0.517143 -0.533408 0.200658 -0.519115 -0.697190 -0.615074 -0.545511 0.171087 0.255232 0.224821 0.207692 0.194378 0.210161 0.213349 0.225057 0.216814 0.237478 0.224352 0.209482 0.219950 0.216092 0.228054 0.234198 0.221886 0.225883 0.199730 0.219598 0.214351 0.324042 0.230421 0.225630 0.223500 0.228507 0.209560 0.231772 0.253945 0.222603 0.246973
chargesum: 0.00000
title: Mulliken charges with hydrogens summed into heavy atoms:
elementType: O O C C C C C C C C C C C C C C C C C C C C
charge: -0.140665 -0.198067 0.379591 0.118175 0.128732 0.281617 0.018532 -0.151864 -0.130982 -0.063550 -0.054799 -0.088720 -0.171176 0.196398 -0.091529 -0.099459 0.200658 -0.063063 -0.035624 -0.129357 -0.075934 0.171087
polarizability: 2.64182333e+02 4.76391467e+00 2.03270444e+02 5.25999193e+00 3.08873043e+00 1.61833904e+02
1716.lowfreq: -10.3637 -7.8812 -0.0007 -0.0005 0.0001 4.3893 32.1769 56.4619 61.2171
frequency: 31.7649 56.3472 61.0894 89.2158 101.0660 118.2704 129.6127 146.8404 173.5736 193.6527 200.9809 206.8879 231.8774 250.1615 259.4548 277.8986 291.5629 317.0609 321.8790 343.5933 345.4714 356.9789 365.1525 386.3407 404.9541 414.6185 431.5341 439.8016 457.6101 475.6499 489.2680 523.9890 543.5505 562.4267 592.9728 609.4794 631.3468 653.0488 689.7868 766.6903 774.5372 783.1017 787.0106 811.0696 827.4309 839.2077 843.5338 865.9360 884.1740 909.2118 917.3864 934.7494 954.0647 964.6262 977.6125 987.6048 995.9926 1003.0412 1014.3440 1018.1263 1031.9616 1040.5117 1056.2588 1078.8686 1087.3386 1098.0468 1100.6871 1105.5722 1116.8342 1129.2264 1133.9180 1143.1978 1153.3181 1166.9747 1174.4833 1183.9515 1194.4404 1197.6821 1209.8316 1213.3471 1223.1219 1240.4205 1248.3017 1252.8559 1255.6327 1258.2567 1271.7764 1282.5444 1286.9508 1290.9093 1298.9829 1310.5313 1314.4684 1326.2809 1330.6269 1334.1864 1337.3880 1340.5540 1341.8992 1354.1396 1363.8956 1376.6794 1391.1355 1392.7573 1424.2754 1440.3660 1454.2938 1457.2564 1458.2604 1459.6291 1464.4169 1469.7901 1471.5132 1472.6955 1479.4780 1490.6662 1491.5096 1499.8082 1638.1981 1686.2260 2890.7969 2932.7400 2939.3739 2943.3688 2946.1964 2953.5186 2958.8987 2961.9623 2969.4031 2975.6246 2981.3514 2984.3545 2984.8419 2988.0224 2988.7747 3004.0039 3010.3765 3012.4576 3013.9148 3030.4411 3036.1004 3040.5390 3051.7396 3072.8800 3074.9628 3078.6653 3081.8238 3084.7652 3089.4130 3539.9067
redmass: 5.6583 3.4681 4.2620 3.3437 2.1460 2.4150 2.5843 2.9629 2.3171 2.4927 2.6779 1.4795 2.2462 1.9013 1.9463 2.0793 2.0970 2.9908 1.3235 2.5453 2.8952 2.5685 2.1000 3.0166 2.6792 2.8799 3.5259 2.6661 3.2232 2.9919 3.5493 2.4458 3.0576 3.7976 3.6556 3.1201 3.5415 2.6039 2.5186 2.6637 2.4279 1.4027 1.7872 1.8092 2.1935 1.9311 2.3130 2.0527 2.1104 1.8294 2.1170 1.9035 1.6983 2.1904 2.4240 2.4149 2.2226 2.1879 1.7866 1.8515 2.0662 2.6622 2.0531 1.7901 2.1619 1.6920 2.1589 1.5192 2.0960 1.9951 2.3778 1.6411 1.8164 1.6000 2.0449 1.5461 1.6875 1.5066 2.1977 1.6901 1.3607 1.3991 1.4272 1.4863 1.6799 1.5773 1.3995 1.4024 1.3586 1.3282 1.4131 1.6463 1.4160 1.5482 1.3665 1.5817 1.5545 1.5000 1.6144 1.4704 1.9800 1.5323 1.2061 1.2000 1.0790 1.0928 1.0760 1.0929 1.0830 1.0777 1.0831 1.0911 1.0794 1.0491 1.0763 1.0580 1.0680 1.0572 9.7503 7.4596 1.0790 1.0655 1.0628 1.0790 1.0663 1.0596 1.0787 1.0611 1.0741 1.0656 1.0611 1.0597 1.0362 1.0451 1.0860 1.0902 1.0971 1.0864 1.0744 1.0916 1.1009 1.1016 1.0990 1.0982 1.0996 1.0975 1.1003 1.0992 1.0995 1.0654
irintensity: 2.6797 1.4224 2.3327 0.5157 0.0479 0.1456 1.3236 2.2116 0.3596 0.0396 0.9457 1.0798 1.3849 5.8489 0.6617 4.5368 3.0258 3.4546 119.0110 2.5408 1.1806 38.7163 6.6525 10.5442 5.3793 21.4039 1.3593 1.8360 11.0722 1.8386 2.7874 0.9367 2.7048 3.7276 0.4365 0.6631 0.8357 0.5256 5.3345 1.8868 4.2066 0.7871 5.8053 1.5253 0.6212 11.3553 1.9755 1.4344 10.2783 4.1668 25.9226 13.0487 12.6795 13.2772 9.4437 11.1184 0.8230 0.5241 3.5763 0.2507 0.2290 1.8195 2.1845 0.9253 20.8871 12.4784 6.4132 5.1369 11.9183 2.6564 10.3797 2.2859 1.9905 7.8482 1.4101 3.1227 14.6505 7.2521 13.7643 4.7977 2.4422 0.8209 8.9943 9.5754 8.0294 19.2049 1.4211 9.2633 2.9329 2.1282 1.5948 3.7384 2.0636 2.1862 0.8816 9.5282 6.5249 5.6444 7.8280 0.2586 5.3997 4.1471 14.6023 24.7785 10.9881 16.6107 4.8410 6.6699 2.3860 4.4760 2.9103 12.4850 12.5986 5.4141 9.5349 10.9317 6.7413 2.4231 206.5453 0.1788 16.0451 11.8587 64.5836 6.3722 24.6752 45.9706 15.8251 28.9888 22.8832 14.8650 23.8509 33.8203 40.3653 22.4782 69.3790 10.5226 23.4661 43.5305 43.6129 15.1627 36.4772 72.8898 24.2437 18.9368 51.6420 26.0230 41.5297 21.8576 41.6445 3.5236
temp: 298.150 k
press: 1.00000 atm
elementType: 8 8 6 6 6 6 6 6 6 6 6 6 6 6 6 6 6 6 6 6 6 6 1 1 1 1 1 1 1 1 1 1 1 1 1 1 1 1 1 1 1 1 1 1 1 1 1 1 1 1 1 1
symmnumber: 1
zpe: 1199594.7 jmol-1
zpe.correction: 0.456901 hartree
zpe.thermalcorrener: 0.478118 hartree
zpe.thermalcorrenthalpy: 0.479062 hartree
zpe.thermalcorrgfe: 0.408778 hartree
zpe.sumelectzpe: -928.861510 hartree
zpe.sumelectthermal: -928.840293 hartree
zpe.sumelectthermalent: -928.839349 hartree
zpe.sumelectthermalfe: -928.909633 hartree
dipole: -3.2015 -0.3574 -0.5145
dipole: 3.2622
quadrupole: -167.9453 -127.2199 -136.2928
quadrupole: 8.8725 -16.0458 3.8886
quadrupole: -24.1260 16.5994 7.5266 8.8725 -16.0458 3.8886
hfenergy: -929.3184113 hartree
pointgroup: C01 [X(C20H30O2)]
dipole: -1.2604552 -0.1394964 -0.1975329 debye
polarizability: 264.217738|4.8645531|203.1026104|4.6703268|4.2111908|161.9663323 unknown
InChI: InChI=1S/C20H30O2/c1-3-20(22)11-9-18-17-6-4-13-12-14(21)5-7-15(13)16(17)8-10-19(18,20)2/h16-18,22H,3-12H2,1-2H3
charge 0 multiplicity 1
52 atoms
O  -3.730872 -0.443603 -1.597605
O  6.196498 -0.649087 0.759637
C  -2.179169 -0.40929 0.381872
C  -1.47659 0.834694 -0.257976
C  0.019229 0.917306 0.091609
C  -3.660902 -0.180917 -0.127748
C  0.717393 -0.366368 -0.451065
C  -1.467462 -1.691904 -0.118255
C  -2.425851 2.005587 0.09012
C  -3.852861 1.365244 0.000838
C  0.061975 -1.642174 0.160662
C  0.739745 2.165334 -0.45665
C  -2.157734 -0.372312 1.935741
C  2.240529 -0.31132 -0.283684
C  -4.745425 -1.030863 0.573506
C  2.189358 2.205186 0.072814
C  2.897882 0.858665 -0.022017
C  3.000767 -1.621381 -0.47314
C  -6.175338 -0.776232 0.047451
C  4.400695 0.920895 0.229498
C  4.496252 -1.413055 -0.827626
C  5.136829 -0.412786 0.120746
H  -1.551519 0.685464 -1.357452
H  0.141031 0.934513 1.196699
H  0.506862 -0.409856 -1.547455
H  -1.606576 -1.785289 -1.215301
H  -1.89689 -2.599391 0.353383
H  -2.316145 2.856753 -0.604269
H  -2.22478 2.3874 1.110217
H  -4.466297 1.61068 0.886488
H  -4.401437 1.718133 -0.888765
H  0.256193 -1.669921 1.251179
H  0.525257 -2.552976 -0.263042
H  0.205415 3.087642 -0.159538
H  0.741972 2.133148 -1.565477
H  -1.130186 -0.293002 2.328333
H  -2.730178 0.481272 2.339982
H  -2.594233 -1.298346 2.352545
H  -4.720142 -0.833227 1.661151
H  -4.494435 -2.106876 0.44694
H  2.192745 2.547803 1.130788
H  2.780625 2.962257 -0.483941
H  -3.658299 -1.423094 -1.737022
H  2.920481 -2.249048 0.438311
H  2.526504 -2.208937 -1.284366
H  -6.495354 0.263084 0.24486
H  -6.231722 -0.938798 -1.042931
H  -6.899532 -1.450729 0.539972
H  4.876346 1.62058 -0.495053
H  4.614778 1.352915 1.227883
H  4.555952 -0.991326 -1.85239
H  5.061512 -2.360152 -0.805056
