program: Gaussian 09
title: 000201517
version: EM64L-G09RevD.01
frameworkgroup: C1[X(C13H17NO)]
method: RPBEPBE
basis: SDD
operation: Freq
keyword: #p
keyword: freq=noraman
keyword: PBEPBE/SDD
title: #p freq=noraman PBEPBE/SDD
converged: YES YES NO NO
title: Mulliken charges:
elementType: O N C C C C C C C C C C C C C H H H H H H H H H H H H H H H H H
charge: -0.274630 -0.424619 0.270472 -0.458408 -0.435133 -0.421659 0.424691 -0.471495 0.096878 -0.714388 -0.387987 -0.415555 -0.251806 -0.229954 -0.242942 0.217858 0.208032 0.233959 0.218644 0.220084 0.196649 0.311470 0.249178 0.234197 0.203678 0.243006 0.225819 0.224136 0.265757 0.225026 0.228705 0.230339
chargesum: 0.00000
title: Mulliken charges with hydrogens summed into heavy atoms:
elementType: O N C C C C C C C C C C C C C
charge: -0.274630 -0.113150 0.270472 -0.032518 0.017469 -0.004927 0.424691 0.011880 0.096878 -0.041885 -0.163851 -0.149799 -0.026780 -0.001249 -0.012602
polarizability: 1.69356088e+02 1.89477581e+00 1.29359991e+02 -6.43215891e+00 1.44832941e+01 1.25959722e+02
1716.lowfreq: -18.7568 -12.7282 -7.9854 -0.0005 -0.0004 0.0007 42.7506 53.6189 72.1788
frequency: 42.2788 53.5080 72.1343 93.8261 120.9811 177.7068 196.8084 237.4252 247.3294 302.7510 335.3973 342.4914 374.4756 405.6484 430.4528 455.8324 488.0957 512.6332 549.1081 571.6509 615.7902 622.1716 696.4872 708.4549 710.7183 755.4920 769.5782 810.1437 855.5711 864.1062 896.2905 906.6809 926.0776 939.6790 979.7663 984.7684 989.0929 999.9139 1026.2562 1042.8811 1058.6742 1075.4926 1083.2593 1098.2336 1104.7415 1136.4312 1162.8714 1173.0375 1191.3391 1211.3230 1213.0468 1250.2853 1299.2197 1314.3570 1316.2209 1321.3225 1332.1579 1347.0401 1363.8091 1379.2016 1392.9210 1406.5236 1433.0188 1446.5886 1456.1203 1466.5912 1473.5980 1479.8981 1480.8030 1488.5320 1589.9218 1609.9461 1614.0875 2980.1650 2983.7484 2990.8911 2991.7060 2995.6440 3039.8344 3051.3828 3059.7443 3069.4517 3071.8830 3086.8168 3118.5352 3128.6002 3140.7086 3152.6150 3165.7070 3501.2717
redmass: 3.6311 5.2782 4.2730 2.4110 2.4165 2.3003 1.6966 2.5903 2.4410 2.6748 3.3839 2.8910 4.0170 2.8310 3.6342 2.7802 2.6956 3.4401 3.2142 2.9956 5.3935 3.3168 1.7321 1.7869 2.0865 1.7875 1.9065 1.6132 1.2581 1.9497 2.3183 2.0113 1.5442 2.0855 1.4546 2.2094 6.0718 1.3320 2.3777 1.9789 1.7229 2.0920 1.6933 2.0111 2.1880 1.4281 2.6906 1.0522 1.1186 1.7861 2.0937 1.2089 1.3546 1.4058 1.5184 1.3807 1.5805 1.4361 3.0792 6.9922 1.3213 1.5350 2.2177 1.1099 1.0938 1.0786 1.0888 2.1553 1.0571 1.0557 6.0802 6.0454 5.4833 1.0377 1.0629 1.0609 1.0654 1.0620 1.1002 1.0995 1.0984 1.0983 1.0974 1.1002 1.0854 1.0867 1.0925 1.0945 1.1009 1.0746
irintensity: 0.4112 0.8949 2.2275 0.5129 0.2508 0.0328 0.5154 1.9965 0.4448 0.4790 0.3826 0.3543 3.5926 0.0945 2.8709 12.3293 13.0130 3.0434 4.1852 8.4539 0.3758 2.2964 53.4872 43.0258 58.5944 6.5976 45.1731 21.5735 0.4292 4.5521 7.9732 13.8261 1.3795 26.8104 1.3301 5.4578 0.9549 0.3415 8.2434 5.8423 2.4618 3.2740 8.7277 0.4913 0.8788 13.8011 12.5958 0.3632 3.9692 5.0598 5.1077 3.0933 17.3271 4.8888 0.1189 2.3595 43.6362 18.5776 148.9378 4.1751 47.8646 7.0626 9.7566 2.0063 0.9907 18.3329 14.2026 15.2320 8.7103 5.3491 2.0366 37.5171 353.2158 27.6124 11.4568 44.6828 15.4204 28.4824 9.2795 37.1542 28.6014 59.8550 19.0589 42.9673 6.9641 0.8182 25.1148 25.0210 20.2935 12.6378
temp: 298.150 k
press: 1.00000 atm
elementType: 8 7 6 6 6 6 6 6 6 6 6 6 6 6 6 1 1 1 1 1 1 1 1 1 1 1 1 1 1 1 1 1
symmnumber: 1
zpe: 714229.1 jmol-1
zpe.correction: 0.272035 hartree
zpe.thermalcorrener: 0.285930 hartree
zpe.thermalcorrenthalpy: 0.286874 hartree
zpe.thermalcorrgfe: 0.231220 hartree
zpe.sumelectzpe: -634.459765 hartree
zpe.sumelectthermal: -634.445870 hartree
zpe.sumelectthermalent: -634.444926 hartree
zpe.sumelectthermalfe: -634.500581 hartree
dipole: -3.2002 1.5897 3.1077
dipole: 4.7357
quadrupole: -97.9417 -86.5687 -91.2705
quadrupole: 4.7839 10.1973 -0.4221
quadrupole: -6.0147 5.3583 0.6564 4.7839 10.1973 -0.4221
hfenergy: -634.7318003 hartree
pointgroup: C01 [X(C13H17N1O1)]
dipole: -1.2490154 0.7580129 1.156184 debye
polarizability: 169.2656398|1.1908306|132.4516628|-6.897557|13.778966|122.9584984 unknown
InChI: InChI=1S/C13H17NO/c1-2-13(10-6-9-12(15)14-13)11-7-4-3-5-8-11/h3-5,7-8,14H,2,6,9-10H2,1H3
charge 0 multiplicity 1
32 atoms
O  3.194984 -0.951853 -1.581789
N  1.462325 0.335501 -0.756362
C  0.473984 0.825471 0.23888
C  1.043128 0.549734 1.66344
C  1.549614 -0.89968 1.796427
C  0.312878 2.369617 0.040132
C  -0.891254 0.10429 0.068615
C  2.715621 -1.143009 0.815321
C  2.475789 -0.600062 -0.595113
C  -0.25723 2.807762 -1.326123
C  -2.013039 0.513781 0.83918
C  -1.057182 -0.97788 -0.830242
C  -3.259511 -0.135834 0.713172
C  -2.30552 -1.630585 -0.960893
C  -3.412893 -1.213307 -0.190881
H  0.25365 0.757629 2.407227
H  1.876415 1.255047 1.855441
H  0.720503 -1.601497 1.586461
H  1.88278 -1.095794 2.832361
H  1.308581 2.82839 0.195639
H  -0.342275 2.754029 0.845028
H  1.360959 0.675139 -1.718287
H  2.957011 -2.215281 0.712838
H  3.637778 -0.651922 1.18576
H  0.413106 2.544648 -2.166413
H  -1.24337 2.349014 -1.517432
H  -0.381764 3.905149 -1.352726
H  -1.919629 1.3474 1.545723
H  -0.206355 -1.314561 -1.431065
H  -4.110267 0.197893 1.318211
H  -2.408757 -2.465329 -1.663464
H  -4.380161 -1.718002 -0.291266
