program: Gaussian 09
title: 000017107
version: EM64L-G09RevD.01
frameworkgroup: C1[X(C7H3Cl4NO3)]
method: RPBEPBE
basis: SDD
operation: Freq
keyword: #p
keyword: freq=noraman
keyword: PBEPBE/SDD
title: #p freq=noraman PBEPBE/SDD
converged: NO YES NO NO
title: Mulliken charges:
elementType: Cl Cl Cl Cl O O O N C C C C C C C H H H
charge: 0.109359 0.109367 0.068386 0.068339 -0.251240 -0.170076 -0.170036 -0.003213 0.764937 0.661537 -0.424274 -0.424328 -0.279318 -0.279252 -0.509646 0.237974 0.237980 0.253503
chargesum: 0.00000
title: Mulliken charges with hydrogens summed into heavy atoms:
elementType: Cl Cl Cl Cl O O O N C C C C C C C
charge: 0.109359 0.109367 0.068386 0.068339 -0.251240 -0.170076 -0.170036 -0.003213 0.764937 0.661537 -0.424274 -0.424328 -0.279318 -0.279252 0.219811
polarizability: 1.84595684e+02 1.13020271e-02 1.89691456e+02 -1.32039970e+00 1.92419316e-01 5.39058534e+01
1716.lowfreq: -106.7833 -10.1172 -5.4749 -3.5497 -0.0020 -0.0017 -0.0017 26.9363 31.9530
frequency: -106.7805 25.9259 31.9439 60.5520 75.5077 137.6176 143.9543 205.5952 208.6077 231.6226 251.2539 273.2879 277.3471 300.9634 310.4385 321.9603 337.1382 359.2273 374.1240 437.6047 602.6421 605.8031 642.6742 656.2856 671.8777 703.8530 767.9825 787.1182 807.0165 872.0394 981.6601 1073.5682 1103.6593 1146.1261 1154.1170 1199.3056 1301.2548 1320.3292 1343.7308 1404.9106 1437.0068 1461.8435 1464.5792 1503.0646 1529.3457 2988.8941 3091.6722 3147.3584
redmass: 16.4555 3.3207 14.1138 13.2237 6.5856 1.0442 7.7676 21.2900 23.3535 7.4019 16.3374 15.2840 17.9413 17.6200 22.3342 12.3698 24.9659 15.9144 10.4838 10.3664 11.3338 12.0885 11.3664 12.6808 14.3828 12.6259 12.6906 10.3910 12.9002 10.1393 11.8294 10.3684 1.2231 1.5967 5.3912 12.5135 12.2997 12.0169 5.7962 14.0966 1.3041 1.0564 1.0578 11.3460 8.5199 1.0301 1.1064 1.1027
irintensity: 0.0012 4.5484 0.6173 0.7372 1.8216 0.1481 2.4526 0.1957 0.3340 3.0286 3.8760 1.8924 1.7034 1.5219 0.1981 0.2695 0.6165 0.7511 5.9666 2.8364 3.4902 0.0389 25.7264 11.6152 81.1527 2.2633 36.1517 0.2514 0.3785 13.2193 154.4148 40.8403 0.0033 27.6234 354.5832 17.9911 46.7093 41.1403 143.6350 172.3663 4.3281 19.1424 19.5527 21.8371 101.1797 48.9781 19.8798 13.2522
temp: 298.150 k
press: 1.00000 atm
elementType: 17 17 17 17 8 8 8 7 6 6 6 6 6 6 6 1 1 1
symmnumber: 1
zpe: 240057.0 jmol-1
zpe.correction: 0.091433 hartree
zpe.thermalcorrener: 0.105839 hartree
zpe.thermalcorrenthalpy: 0.106783 hartree
zpe.thermalcorrgfe: 0.047357 hartree
zpe.sumelectzpe: -2387.957504 hartree
zpe.sumelectthermal: -2387.943098 hartree
zpe.sumelectthermalent: -2387.942154 hartree
zpe.sumelectthermalfe: -2388.001580 hartree
dipole: 5.1592 -0.0019 1.6319
dipole: 5.4111
quadrupole: -119.3171 -114.5178 -110.5111
quadrupole: -0.0061 7.7229 -0.1007
quadrupole: -4.5351 0.2642 4.2709 -0.0061 7.7229 -0.1007
hfenergy: -2388.0489367 hartree
pointgroup: C01 [X(C7H3Cl4N1O3)]
dipole: 2.0187442 -0.0002921 -0.6759321 debye
dipolederiv: -0.0436186 -0.2070778 0.0059622 -0.205948 -0.5286412 0.0037218 -0.0047833 -0.0065965 0.0454935 -0.0432185 0.2068214 0.0032111 0.2058024 -0.5284755 -0.0006644 -0.0089553 0.0124862 0.0452891 -0.2299569 0.3040397 -0.0111733 0.3142467 -0.453053 0.0301213 0.002557 0.0123325 0.0074761 -0.2300537 -0.3040892 -0.0107008 -0.3140836 -0.4530777 -0.0293271 0.0027018 -0.0112353 0.0075261 -1.6134669 0.0000745 0.3134596 -0.0007134 -0.3293193 0.0001103 0.1271076 -0.0001837 -0.388484 -0.7042341 -0.1919993 -0.0187837 -0.2071219 -0.5492355 -0.0155673 -0.0272316 -0.0191912 -0.1962279 -0.7046489 0.1927276 -0.010309 0.2079151 -0.5490881 -0.0042687 -0.0202279 0.000483 -0.1955336 1.9584241 -0.0007262 0.054496 -0.0011248 0.9888102 0.0245921 0.0784801 0.0192454 0.1886422 -0.9978164 -0.0000752 -0.0263615 0.0001724 -0.2646064 -0.0024119 -0.0410741 0.0011984 0.1528168 1.2872083 -0.0000179 -0.1249025 0.0002623 0.1249371 -0.0003483 0.1702975 -0.00034 0.0449051 0.3682147 0.5166146 0.0026077 0.1653576 0.6639851 0.0020654 0.0137676 0.0140712 -0.0614019 0.3678401 -0.5161806 0.0054123 -0.1650874 0.6637016 -0.0085456 0.0244807 -0.0230711 -0.0610313 -0.0597972 -0.6952327 0.0482308 -0.7932524 0.4647044 -0.0429787 0.025207 -0.0256809 -0.0490749 -0.0596258 0.6952005 0.0456009 0.7931663 0.4646491 0.0434468 0.0233308 0.0263709 -0.0492558 0.6984944 -0.0000451 -0.2276905 0.0003787 0.2621975 0.00006 -0.5046756 0.0001385 0.4762733 0.0572361 0.0631165 -0.0160383 -0.0062943 -0.0490636 0.1198377 0.0920219 0.0615261 -0.0155352 0.0571445 -0.0631295 -0.0159635 0.0063595 -0.0492432 -0.1198141 0.0922338 -0.0615228 -0.0154218 -0.1081253 -0.0000212 -0.0170576 -0.0000353 0.1208183 -0.0000293 -0.0452377 -0.0000306 0.0635442 unknown
polarizability: 184.6032403|-0.0068798|189.6916345|-0.8690119|0.116497|53.8981188 unknown
InChI: InChI=1S/C7H3Cl4NO3/c1-15-7-4(10)2(8)6(12(13)14)3(9)5(7)11/h1H3
charge 0 multiplicity 1
18 atoms
Cl -1.267794 -2.87164 0.017881
Cl -1.267562 2.871664 0.007747
Cl 1.860861 -2.73485 0.154272
Cl 1.861045 2.735027 0.14959
O  2.997353 0.000058 0.308188
O  -3.368009 -1.128235 -0.109574
O  -3.369539 1.129153 -0.064536
N  -2.757122 0.000312 -0.059126
C  -1.246495 0.000076 0.008705
C  1.622419 0.000072 0.138178
C  -0.516637 -1.235227 0.041675
C  -0.516586 1.235327 0.040584
C  0.896586 -1.214836 0.101551
C  0.896653 1.214963 0.100021
C  3.823679 -0.000213 -0.930591
H  3.622348 0.909547 -1.523418
H  3.62256 -0.910438 -1.522779
H  4.86254 0.000039 -0.57337
