program: Gaussian 09
title: 000201546
version: EM64L-G09RevD.01
frameworkgroup: C1[X(C13H19NO3)]
method: RPBEPBE
basis: SDD
operation: Freq
keyword: #p
keyword: freq=noraman
keyword: PBEPBE/SDD
title: #p freq=noraman PBEPBE/SDD
converged: YES YES NO NO
title: Mulliken charges:
elementType: O O O N C C C C C C C C C C C C C H H H H H H H H H H H H H H H H H H H
charge: -0.280723 -0.309888 -0.258973 -0.310607 0.407577 0.060119 0.129167 0.217233 -0.522135 -0.411533 -0.314758 -0.394672 -0.313137 -0.269526 -0.362596 -0.694757 -0.624065 0.219523 0.205162 0.237623 0.233167 0.225349 0.226728 0.227667 0.247756 0.234189 0.209806 0.194640 0.203143 0.218683 0.209447 0.243194 0.285583 0.220096 0.190131 0.221385
chargesum: 0.00000
title: Mulliken charges with hydrogens summed into heavy atoms:
elementType: O O O N C C C C C C C C C C C C C
charge: -0.280723 -0.309888 -0.258973 -0.025024 0.407577 0.060119 0.129167 0.217233 -0.097449 -0.173910 0.143757 -0.146916 0.141259 0.174470 0.035186 -0.023433 0.007548
polarizability: 2.01647304e+02 9.82891592e+00 1.78014149e+02 3.73182803e+00 -6.90192882e+00 1.01547784e+02
1716.lowfreq: -11.6726 -5.3117 -3.0216 -0.0002 0.0005 0.0008 26.2621 43.0685 58.4218
frequency: 25.9674 43.0565 58.3932 68.4109 76.1869 95.9087 120.2989 130.4665 159.5455 198.0421 213.2720 228.2113 259.6832 275.1065 279.7012 312.2683 320.2736 336.5272 374.0825 436.8529 455.2268 476.1514 500.0782 527.8763 564.2312 595.8771 626.7935 650.0924 694.4424 713.0660 752.9439 783.1318 810.1054 817.0708 845.7955 869.8608 876.7893 918.6001 933.5043 959.5285 982.5168 993.6577 1032.2637 1036.1586 1056.6472 1065.6719 1078.3375 1084.7194 1087.1502 1121.9753 1143.7570 1149.8778 1176.2034 1182.7177 1204.4171 1206.0927 1230.9957 1244.2511 1254.8011 1264.0739 1279.9472 1318.4053 1347.8563 1352.3603 1356.7491 1370.3527 1380.8750 1382.0716 1424.6640 1434.3937 1446.5289 1454.4314 1458.9604 1463.2789 1466.6497 1469.1769 1471.2370 1472.8130 1476.2413 1491.8023 1493.5318 1584.6839 1607.3505 2863.0848 2872.0689 2978.1253 2987.6706 2989.3802 2994.2252 3004.7139 3006.2092 3007.1005 3039.3669 3072.5172 3073.2680 3074.9313 3088.9759 3095.3714 3100.8455 3133.9813 3169.8135 3460.8117
redmass: 3.6021 3.5305 2.4700 2.8033 3.1802 3.3594 3.7511 3.1725 4.3865 1.4446 1.3873 2.4319 1.9108 2.4685 3.2606 2.3510 2.3597 5.4762 5.0788 5.2133 4.6328 3.9834 3.6754 3.7235 4.2960 3.3075 3.6426 4.6531 1.4487 3.8634 5.8338 1.2666 1.4072 2.7426 3.4906 2.0421 2.7867 2.4962 1.3394 3.3423 2.0576 2.4615 2.1091 2.5504 2.9545 2.0262 1.6146 2.1039 2.0033 1.5100 2.1619 1.5325 3.4061 2.3420 1.2271 1.2057 1.4980 1.3268 1.4424 1.3141 2.2730 1.5633 1.2827 1.3574 1.3186 1.4708 2.8885 1.5205 3.7138 1.1407 1.2214 1.2254 1.1477 1.0774 1.4890 1.0894 1.0757 1.0840 1.4588 1.0848 1.0484 7.7712 8.1359 1.0633 1.0641 1.0353 1.0595 1.0640 1.0672 1.0613 1.0794 1.0775 1.1015 1.0988 1.0996 1.1053 1.1011 1.0999 1.1032 1.0889 1.0953 1.0741
irintensity: 0.1925 0.3219 0.2188 3.6406 3.9940 3.9728 6.0774 1.5331 0.8166 0.4625 3.3853 0.8977 2.7721 9.0782 4.0608 4.9513 2.0714 3.1468 1.1228 1.1209 1.3398 3.3444 2.5411 3.6513 1.1496 5.6075 3.6428 1.7525 121.8100 2.5161 1.9239 4.8797 49.5480 4.5405 4.9995 9.6322 35.6643 24.0927 0.1448 45.6586 48.4002 53.3439 30.0846 60.1307 101.2886 2.2729 5.0391 29.5570 3.7851 3.5616 35.8336 2.1614 60.4242 21.0055 5.4076 4.5495 12.2122 1.2760 64.8533 1.9229 129.8175 19.1284 15.7456 17.7321 1.4606 8.9216 4.1558 10.9219 93.7181 3.2499 44.3045 12.5641 19.3398 14.4044 67.2246 22.8685 11.8910 13.8993 21.1144 13.8605 17.0991 16.0393 20.7705 65.9211 185.7931 46.7808 28.0468 16.0395 53.8185 45.8431 118.9364 23.5876 10.5309 22.9361 59.1725 30.7377 37.0662 32.9858 21.8797 12.8250 7.4303 3.9483
temp: 298.150 k
press: 1.00000 atm
elementType: 8 8 8 7 6 6 6 6 6 6 6 6 6 6 6 6 6 1 1 1 1 1 1 1 1 1 1 1 1 1 1 1 1 1 1 1
symmnumber: 1
zpe: 789514.6 jmol-1
zpe.correction: 0.300710 hartree
zpe.thermalcorrener: 0.318250 hartree
zpe.thermalcorrenthalpy: 0.319195 hartree
zpe.thermalcorrgfe: 0.254315 hartree
zpe.sumelectzpe: -785.843622 hartree
zpe.sumelectthermal: -785.826082 hartree
zpe.sumelectthermalent: -785.825137 hartree
zpe.sumelectthermalfe: -785.890017 hartree
dipole: -0.9973 -2.2942 0.3698
dipole: 2.5288
quadrupole: -95.4407 -89.0398 -105.4616
quadrupole: 8.5851 1.0473 -1.2012
quadrupole: 1.2067 7.6076 -8.8142 8.5851 1.0473 -1.2012
hfenergy: -786.1443319 hartree
pointgroup: C01 [X(C13H19N1O3)]
dipole: 0.219559 0.9290389 0.2801814 debye
polarizability: 196.0995418|15.4073638|179.0708347|-8.4390833|17.2644476|106.03886 unknown
InChI: InChI=1S/C13H19NO3/c1-3-10-4-5-11-13(17-9-8-15-11)12(10)16-7-6-14-2/h4-5,14H,3,6-9H2,1-2H3
charge 0 multiplicity 1
36 atoms
O  0.910363 1.839466 0.581083
O  -1.236516 0.007261 0.353454
O  3.581642 0.982479 -0.252798
N  -4.041253 0.052548 -0.203734
C  0.256867 -1.673651 -0.555367
C  0.0581 -0.351161 -0.074604
C  1.153435 0.545988 0.047252
C  2.454285 0.126574 -0.33992
C  -0.91178 -2.641272 -0.654491
C  1.57285 -2.070458 -0.903339
C  2.146757 2.508736 1.039821
C  2.66497 -1.185055 -0.807061
C  3.226278 2.399718 -0.04034
C  -1.861005 1.20931 -0.2750
C  -3.299637 1.249807 0.231612
C  -1.316073 -3.238382 0.720079
C  -5.445363 0.008196 0.238791
H  -1.787631 -2.123086 -1.089055
H  -0.643175 -3.46228 -1.346058
H  1.738011 -3.0886 -1.273268
H  2.490769 2.034463 1.979304
H  1.861761 3.555916 1.229518
H  2.862691 2.835627 -0.991581
H  4.160875 2.897228 0.265259
H  3.677037 -1.483864 -1.095071
H  -1.299737 2.112759 0.020645
H  -1.838933 1.084341 -1.375131
H  -3.284645 1.378191 1.343523
H  -3.789343 2.149887 -0.192515
H  -0.47176 -3.787193 1.175573
H  -2.163261 -3.941084 0.610487
H  -1.615227 -2.434595 1.415307
H  -3.518455 -0.795013 0.053142
H  -6.011375 0.835044 -0.231048
H  -5.583788 0.095726 1.345386
H  -5.908334 -0.93917 -0.089855
