program: Gaussian 09
title: 000201516
version: EM64L-G09RevD.01
frameworkgroup: C1[X(C13H23NO)]
method: RPBEPBE
basis: SDD
operation: Freq
keyword: #p
keyword: freq=noraman
keyword: PBEPBE/SDD
title: #p freq=noraman PBEPBE/SDD
converged: YES YES NO NO
title: Mulliken charges:
elementType: O N C C C C C C C C C C C C C H H H H H H H H H H H H H H H H H H H H H H H
charge: -0.253420 -0.435395 0.443584 -0.073687 -0.523168 -0.461998 -0.447760 -0.436386 -0.409165 -0.407194 -0.541638 -0.382333 0.110969 -0.377433 -0.698299 0.189983 0.226763 0.225746 0.207105 0.209862 0.218032 0.188623 0.199611 0.205484 0.301863 0.199576 0.191926 0.190252 0.203106 0.245081 0.250793 0.200471 0.189839 0.197440 0.206215 0.215867 0.210568 0.219118
chargesum: 0.00000
title: Mulliken charges with hydrogens summed into heavy atoms:
elementType: O N C C C C C C C C C C C C C
charge: -0.253420 -0.133532 0.443584 0.116297 -0.070659 -0.045031 -0.041106 -0.031291 -0.017663 -0.013836 -0.045763 0.007977 0.110969 0.026221 -0.052746
polarizability: 1.58760928e+02 8.57171044e+00 1.46056928e+02 7.75663699e-01 1.54887115e+00 1.26086960e+02
1716.lowfreq: -14.7740 -10.3004 0.0002 0.0003 0.0005 5.6027 45.2382 49.7091 72.4540
frequency: 45.2334 49.5624 72.3428 81.0266 93.3000 106.2848 170.4103 201.9313 219.9955 237.8849 247.0688 267.4752 313.0217 325.3087 354.5223 368.7133 427.5486 432.3783 479.5048 489.8559 503.6071 574.2541 600.0688 640.9498 675.5527 734.2646 760.5189 782.6159 799.7117 819.2459 844.0988 857.1718 886.4196 889.1042 897.2301 908.7128 918.0437 961.3999 975.3950 999.7849 1025.5381 1049.6227 1052.2539 1058.6707 1066.8590 1074.3565 1098.0261 1114.3175 1120.0689 1140.1327 1157.8560 1183.2667 1189.2993 1220.9285 1237.2864 1246.6972 1258.6554 1261.7391 1269.1496 1274.8638 1288.4308 1295.8613 1302.8101 1306.6280 1317.0207 1332.5605 1336.3409 1341.8185 1344.2574 1346.4155 1357.1513 1377.9429 1391.8654 1452.8863 1457.2861 1460.2450 1463.0700 1465.4181 1470.0266 1472.4402 1473.0293 1477.1302 1478.5020 1485.8052 1657.3988 2936.0871 2963.2182 2964.0170 2965.3270 2966.3088 2966.4735 2969.8414 2973.8527 2975.4113 3008.6341 3013.6411 3022.9421 3025.2977 3027.5663 3031.2789 3035.4190 3037.5162 3044.6883 3070.9069 3075.4433 3075.6418 3092.7263 3559.8726
redmass: 2.9911 4.3908 3.0886 1.9900 2.6645 2.6241 2.4834 2.2713 1.7368 1.4910 2.2881 3.8223 3.4189 1.9570 2.5529 3.0054 2.8108 2.7111 1.9803 1.9124 2.0112 2.5819 2.6329 2.7886 2.6215 1.2665 1.9973 1.4753 1.9641 3.4039 1.9907 1.4240 1.7490 1.8952 1.5627 2.4437 2.1302 2.0634 1.9281 2.0050 1.9822 2.5525 1.8672 1.3681 1.5344 1.8007 1.9531 2.5532 1.9962 1.6258 2.8756 1.6830 1.4845 1.9312 1.3286 1.3437 1.2779 1.3016 1.3819 1.5710 1.3354 1.2911 1.3332 1.3862 1.7022 1.4512 1.4170 1.4818 1.5107 1.4620 1.4992 1.8158 1.2135 1.0820 1.0866 1.0803 1.0887 1.0908 1.0804 1.0724 1.0883 1.0436 1.0927 1.0716 8.8343 1.0801 1.0652 1.0612 1.0623 1.0591 1.0627 1.0624 1.0459 1.0511 1.0974 1.0636 1.0660 1.0958 1.0947 1.1001 1.1004 1.1003 1.1018 1.1007 1.1007 1.0997 1.1015 1.0778
irintensity: 0.1182 1.9496 0.2564 0.1685 0.5665 1.3133 0.1456 0.1347 0.2155 0.2353 0.5116 0.1361 0.6692 0.2917 0.0539 2.6323 0.8240 1.5403 3.6582 20.3232 20.9661 20.8503 37.1345 68.1854 0.4371 9.8572 9.5468 0.0711 2.4929 2.1381 7.2030 1.0571 3.3286 6.9463 9.5136 0.6334 2.0784 6.3173 4.1189 8.2505 2.8699 1.4192 0.4240 0.5342 0.7992 1.0379 6.0990 0.4157 1.5578 8.2110 5.0676 8.3787 11.2535 34.0558 0.9964 8.5611 1.6240 0.6496 20.5761 40.9017 2.3593 12.5254 27.1119 17.6257 22.0419 1.3221 0.9794 0.5808 2.1643 0.4693 1.4304 40.1625 10.2630 2.5369 1.9301 8.2923 7.5991 9.7383 23.1151 2.0135 12.4817 12.1803 4.4843 10.0962 495.8517 14.8552 42.1785 28.8683 6.7710 6.5205 34.4457 18.4439 35.8292 86.1320 1.7007 15.4718 15.3613 67.0999 95.4992 15.8925 19.3632 44.4895 114.1869 68.0026 14.3747 44.7006 30.0274 13.1537
temp: 298.150 k
press: 1.00000 atm
elementType: 8 7 6 6 6 6 6 6 6 6 6 6 6 6 6 1 1 1 1 1 1 1 1 1 1 1 1 1 1 1 1 1 1 1 1 1 1 1
symmnumber: 1
zpe: 891610.0 jmol-1
zpe.correction: 0.339596 hartree
zpe.thermalcorrener: 0.355196 hartree
zpe.thermalcorrenthalpy: 0.356141 hartree
zpe.thermalcorrgfe: 0.296689 hartree
zpe.sumelectzpe: -637.982109 hartree
zpe.sumelectthermal: -637.966509 hartree
zpe.sumelectthermalent: -637.965565 hartree
zpe.sumelectthermalfe: -638.025017 hartree
dipole: 3.4265 3.1238 1.7430
dipole: 4.9535
quadrupole: -105.9152 -100.6272 -91.2034
quadrupole: -11.7429 -6.7718 -6.2934
quadrupole: -6.6666 -1.3786 8.0452 -11.7429 -6.7718 -6.2934
hfenergy: -638.3217056 hartree
pointgroup: C01 [X(C13H23N1O1)]
dipole: 1.4846261 1.0614541 0.6835033 debye
polarizability: 160.5990147|6.840972|144.2230688|0.9180221|1.4236947|126.082732 unknown
InChI: InChI=1S/C13H23NO/c1-2-9-13(10-8-12(15)14-13)11-6-4-3-5-7-11/h11,14H,2-10H2,1H3
charge 0 multiplicity 1
38 atoms
O  -3.318049 -1.890955 -0.981293
N  -1.417868 -0.509145 -0.760769
C  -0.544652 0.12134 0.267076
C  0.960308 0.034441 -0.168188
C  -0.893464 -0.746807 1.531278
C  1.929811 0.595805 0.908139
C  1.408213 -1.39235 -0.585534
C  -1.007729 1.597816 0.5066
C  3.398817 0.580924 0.417568
C  2.869935 -1.398893 -1.094036
C  -2.289723 -1.358852 1.249848
C  3.838787 -0.831889 -0.030587
C  -2.436479 -1.318031 -0.281648
C  -0.877744 2.554499 -0.700421
C  -1.497977 3.939453 -0.411703
H  1.071385 0.67667 -1.070991
H  -0.873942 -0.134282 2.448042
H  -0.152166 -1.554587 1.653199
H  1.848488 -0.018687 1.828941
H  1.650276 1.629544 1.18665
H  0.731157 -1.792724 -1.363022
H  1.333339 -2.080621 0.281361
H  -0.449871 2.017866 1.36645
H  -2.072568 1.561937 0.815776
H  -1.352393 -0.284291 -1.754679
H  4.065864 0.955913 1.218048
H  3.501581 1.280958 -0.437955
H  2.940545 -0.785003 -2.016408
H  3.165661 -2.428666 -1.3733
H  -3.113279 -0.767962 1.692198
H  -2.403173 -2.394668 1.608761
H  4.872277 -0.80286 -0.426854
H  3.850964 -1.508476 0.849219
H  -1.381924 2.111099 -1.583073
H  0.188019 2.683557 -0.973643
H  -2.57637 3.84982 -0.182817
H  -1.009761 4.420191 0.457019
H  -1.391296 4.618018 -1.277554
