program: Gaussian 09
title: 000201589
version: EM64L-G09RevD.01
frameworkgroup: C1[X(C20H25NO3)]
method: RPBEPBE
basis: SDD
operation: Freq
keyword: #p
keyword: freq=noraman
keyword: PBEPBE/SDD
title: #p freq=noraman PBEPBE/SDD
converged: YES YES NO NO
title: Mulliken charges:
elementType: O O O N C C C C C C C C C C C C C C C C C C C C H H H H H H H H H H H H H H H H H H H H H H H H H
charge: -0.289931 -0.177201 -0.271806 -0.112135 -0.115873 -0.433479 0.049267 0.276439 0.394129 -0.616163 -0.619537 -0.386507 -0.334141 -0.353853 -0.353159 0.335765 -0.354098 -0.370154 -0.250022 -0.395059 -0.265291 -0.233339 -0.226071 -0.679411 0.235629 0.248272 0.234307 0.222483 0.199338 0.227891 0.257888 0.199338 0.220691 0.251062 0.239222 0.295723 0.279103 0.250113 0.243991 0.196325 0.198982 0.217249 0.218667 0.232668 0.234109 0.233421 0.208889 0.226322 0.209949
chargesum: 0.00000
title: Mulliken charges with hydrogens summed into heavy atoms:
elementType: O O O N C C C C C C C C C C C C C C C C C C C C
charge: -0.289931 -0.177201 -0.271806 -0.112135 0.119756 0.049100 0.049267 0.276439 0.394129 0.033549 0.058380 -0.135445 -0.094919 -0.058131 -0.074055 0.335765 -0.103986 -0.126163 0.145286 0.040858 -0.032623 0.000770 0.007350 -0.034252
polarizability: 2.94277569e+02 -1.11008502e+01 2.46395705e+02 2.24164001e+01 -1.17360800e+01 1.82631909e+02
1716.lowfreq: -5.2951 -0.0002 0.0008 0.0011 1.2835 5.1803 16.3265 23.5273 28.4666
frequency: 16.3058 23.5001 28.4228 38.3509 51.7198 57.4017 65.5589 76.7487 77.5624 106.8029 122.2523 141.3354 146.6812 167.2111 193.4660 211.7027 216.2249 220.8474 225.3380 241.9473 264.6615 293.2672 309.1311 328.1923 342.4228 367.8862 399.0778 404.4042 416.6907 419.4197 445.6740 464.0541 481.5585 513.9768 517.4613 572.6988 612.7299 629.0356 667.3863 678.5473 707.4730 710.7498 738.6152 767.3385 782.0273 787.9267 792.6064 811.1726 828.2149 857.7989 873.5855 894.0446 901.9963 910.8104 939.2772 946.9695 954.0912 965.6499 986.4255 987.2184 996.6798 1004.9989 1013.8781 1025.9256 1029.3400 1038.2156 1051.1941 1054.3845 1064.5553 1087.5818 1091.3935 1113.0069 1135.5739 1139.3711 1141.1678 1172.6874 1175.9158 1177.7467 1192.9283 1199.6279 1215.6614 1229.1116 1230.2335 1250.0773 1270.0319 1275.9167 1284.0999 1299.2921 1309.4885 1329.8181 1344.4920 1367.1738 1371.2456 1384.8350 1386.0778 1395.1195 1423.0611 1425.1119 1436.5299 1443.2394 1458.7315 1463.8208 1472.2367 1473.5690 1478.2877 1478.7258 1479.5677 1484.0305 1487.2297 1488.5144 1495.8383 1574.3538 1590.1581 1598.8719 1614.0485 1624.9702 2873.4551 2886.0102 2907.7320 2936.4694 2977.2579 2979.1156 2992.4407 3004.1858 3021.8395 3033.4237 3041.3754 3051.2487 3079.2428 3079.9064 3082.2635 3091.7522 3096.5192 3129.0700 3141.6094 3145.4712 3153.4516 3153.6220 3166.0818 3166.1679 3175.1166
redmass: 4.4168 4.8749 3.6219 3.3772 3.5379 3.2843 4.1332 2.3382 2.5194 5.4494 3.6235 3.4111 4.6642 4.6085 1.8439 2.0318 1.4719 1.3699 3.1009 2.1651 2.2289 3.8128 7.0843 3.8777 2.3561 7.2695 3.3029 3.0491 2.9924 2.8108 3.5803 3.8527 4.6508 2.6967 3.6878 5.9434 6.4231 6.8285 6.5038 4.5958 1.7143 3.5695 5.3698 1.0928 1.9586 5.2354 1.3382 5.7984 1.5659 4.8382 1.2543 1.1701 1.7122 1.3302 2.6962 3.5411 1.3371 1.6642 6.9641 5.3327 2.5749 1.3949 1.3571 2.2281 2.1933 1.6529 3.0940 2.7591 2.4586 1.6190 1.2876 1.2556 2.1828 1.4844 1.4419 1.1027 1.2583 1.8032 2.8695 1.1653 2.2793 1.3565 3.3507 1.8275 2.1701 1.5324 1.1042 1.2949 1.3562 1.3783 1.3513 1.3751 2.2536 2.0729 8.0913 1.2634 1.1426 3.9184 2.2319 1.1526 1.0462 1.0741 1.0999 1.0721 1.0834 1.1238 1.0455 2.0545 1.2706 1.0552 1.5998 6.6543 7.6900 6.4802 6.8851 6.5367 1.0548 1.0552 1.0684 1.0549 1.0363 1.0826 1.1062 1.0601 1.0751 1.0761 1.0903 1.1013 1.1011 1.1029 1.0988 1.1008 1.0933 1.0861 1.0905 1.0871 1.0878 1.0952 1.0971 1.0994 1.0974
irintensity: 0.2366 1.2669 0.8340 1.0852 0.1868 1.3005 1.0575 0.0622 0.2326 0.7351 0.4061 2.2388 0.9130 4.1152 0.5904 0.5678 0.0290 2.3286 1.3069 1.3434 1.7376 4.4958 4.5083 2.1233 8.1597 0.4342 1.9079 0.6971 0.1918 0.2471 1.5839 3.0559 0.0481 12.5862 16.2766 1.6058 0.1037 4.2018 11.1593 2.0362 55.0203 1.8625 58.2618 14.2567 41.2401 3.7852 11.8970 6.8108 66.0062 29.7758 0.1167 1.4436 8.7305 1.0452 19.4790 74.7488 0.2235 15.2005 86.8442 1.4960 33.2183 0.1873 3.7652 16.1607 23.9728 24.0718 67.4276 5.1140 31.0932 6.8081 13.3458 15.1289 10.5043 8.1398 0.4458 12.2740 7.0370 12.9250 530.4356 7.7266 133.4046 2.0744 24.5022 12.0842 29.9042 10.5017 0.0151 10.0288 1.1239 4.2932 9.1491 17.1674 6.8611 5.0090 3.3941 27.2687 2.8201 4.0414 18.8717 3.3194 5.6149 18.1593 44.3349 20.1374 59.7591 15.4682 15.0961 4.6244 164.8411 9.2506 127.9936 72.9312 7.5945 59.5185 19.8330 9.2469 93.6791 149.6029 63.5326 34.3338 37.3161 27.0213 32.4165 24.6365 33.7476 36.8000 24.2777 0.0117 27.6638 84.9789 47.1491 37.8574 13.2486 0.3707 8.9244 29.8131 5.6376 14.1630 2.0023 47.0045 3.3864
temp: 298.150 k
press: 1.00000 atm
elementType: 8 8 8 7 6 6 6 6 6 6 6 6 6 6 6 6 6 6 6 6 6 6 6 6 1 1 1 1 1 1 1 1 1 1 1 1 1 1 1 1 1 1 1 1 1 1 1 1 1
symmnumber: 1
zpe: 1064115.5 jmol-1
zpe.correction: 0.405300 hartree
zpe.thermalcorrener: 0.429864 hartree
zpe.thermalcorrenthalpy: 0.430808 hartree
zpe.thermalcorrgfe: 0.347984 hartree
zpe.sumelectzpe: -1055.713147 hartree
zpe.sumelectthermal: -1055.688583 hartree
zpe.sumelectthermalent: -1055.687639 hartree
zpe.sumelectthermalfe: -1055.770463 hartree
dipole: -2.2663 1.4019 -3.9358
dipole: 4.7531
quadrupole: -121.2017 -128.5899 -148.6793
quadrupole: 5.8337 1.6310 -1.4211
quadrupole: 11.6220 4.2337 -15.8557 5.8337 1.6310 -1.4211
hfenergy: -1056.1184468 hartree
pointgroup: C01 [X(C20H25N1O3)]
dipole: 0.6420383 -0.5949826 1.6524876 debye
polarizability: 283.6628302|-20.9102945|218.7715328|37.2014314|26.8289614|220.8708199 unknown
InChI: InChI=1S/C20H25NO3/c1-4-14-23-17-10-12-18(13-11-17)24-19(15-21(2)3)20(22)16-8-6-5-7-9-16/h5-13,19H,4,14-15H2,1-3H3
charge 0 multiplicity 1
49 atoms
O  0.237422 -1.12106 -1.436398
O  1.461415 1.354203 -1.088871
O  -5.11542 0.487314 -0.675849
N  2.556617 -3.11564 -0.011779
C  1.271417 -0.99492 -0.411303
C  2.449498 -1.907164 -0.859759
C  1.744143 0.470874 -0.234325
C  2.569516 0.78248 0.984119
C  -1.065014 -0.660396 -1.138436
C  3.869833 -3.782596 -0.144653
C  1.43403 -4.0607 -0.212986
C  -2.018932 -0.858289 -2.167825
C  -1.459217 -0.064285 0.079074
C  2.989662 -0.219482 1.904531
C  2.931713 2.138203 1.21431
C  -3.756214 0.130276 -0.756216
C  -3.352851 -0.465892 -1.979245
C  -2.806061 0.330378 0.271495
C  -5.580684 1.120236 0.568949
C  -7.072443 1.416818 0.395595
C  3.758303 0.140007 3.03295
C  3.693233 2.491782 2.344741
C  4.107505 1.492021 3.258941
C  -7.670848 2.085763 1.652391
H  0.888451 -1.371647 0.559127
H  2.277359 -2.137362 -1.937802
H  3.407879 -1.362618 -0.787946
H  3.928282 -4.624018 0.568657
H  4.05888 -4.188371 -1.169268
H  4.678272 -3.069709 0.097864
H  0.469488 -3.540409 -0.090563
H  1.438337 -4.524108 -1.229789
H  1.491662 -4.866804 0.539789
H  -1.692396 -1.31529 -3.106654
H  -0.74126 0.123616 0.883168
H  2.743048 -1.276281 1.734921
H  2.600948 2.890308 0.489949
H  -4.09997 -0.608656 -2.765718
H  -3.087427 0.796088 1.220462
H  -5.410653 0.4331 1.425684
H  -5.009809 2.056173 0.750069
H  -7.60065 0.47027 0.176023
H  -7.204676 2.070256 -0.486743
H  4.084557 -0.633484 3.736906
H  3.964937 3.538906 2.517323
H  4.699294 1.76579 4.139809
H  -7.569386 1.436024 2.542161
H  -8.745889 2.294606 1.510544
H  -7.168705 3.045983 1.875579
