program: Gaussian 09
title: 000201512
version: EM64L-G09RevD.01
frameworkgroup: C1[X(C13H17NO2)]
method: RPBEPBE
basis: SDD
operation: Freq
keyword: #p
keyword: freq=noraman
keyword: PBEPBE/SDD
title: #p freq=noraman PBEPBE/SDD
converged: YES YES NO NO
title: Mulliken charges:
elementType: O O N C C C C C C C C C C C C C H H H H H H H H H H H H H H H H H
charge: -0.246836 -0.264713 -0.434549 0.271342 -0.495616 -0.435883 -0.532656 0.438212 0.117367 -0.710575 -0.394283 -0.416512 -0.375744 -0.360717 0.318704 -0.537445 0.248074 0.228054 0.222634 0.199465 0.253721 0.246006 0.314705 0.214190 0.238845 0.221689 0.232033 0.260160 0.249676 0.241199 0.221566 0.246187 0.221702
chargesum: 0.00000
title: Mulliken charges with hydrogens summed into heavy atoms:
elementType: O O N C C C C C C C C C C C C C
charge: -0.246836 -0.264713 -0.119844 0.271342 -0.019488 -0.013784 -0.032929 0.438212 0.117367 -0.035852 -0.162250 -0.156352 -0.126068 -0.119518 0.318704 0.152010
polarizability: 2.06625438e+02 -3.38273784e+00 1.43184913e+02 2.38558205e+00 1.05725713e+01 1.07661257e+02
1716.lowfreq: -19.9287 -6.5047 -2.6565 0.0004 0.0006 0.0009 30.1029 56.7544 61.2885
frequency: 29.5175 56.7525 61.2805 101.4222 117.5972 130.4622 173.7349 183.2150 201.4241 235.4293 248.6677 273.1634 281.8346 357.5816 372.4216 394.0281 414.3570 464.8836 489.4458 507.0755 511.4847 553.4877 584.3545 608.5864 633.3558 652.1804 723.2655 738.1607 766.3313 787.8317 815.0277 821.9730 834.3100 880.2543 906.7978 943.2534 955.7156 969.7978 987.9100 991.6982 1002.0819 1007.3851 1049.3292 1078.0620 1095.2667 1112.3663 1115.0947 1129.6072 1158.1376 1159.7231 1179.4689 1202.0774 1227.9266 1234.8003 1264.2531 1274.2282 1284.7103 1303.0082 1311.6072 1328.6211 1364.6578 1369.9615 1389.8432 1415.9016 1436.5919 1454.4850 1467.5846 1471.6519 1473.8864 1475.6608 1478.7831 1488.5577 1501.2414 1580.6245 1622.4474 1660.1777 2960.2830 2982.1427 2986.1647 3013.6427 3023.8841 3033.1553 3048.2223 3074.9230 3079.3790 3083.4595 3095.3998 3125.7049 3134.5752 3141.4261 3160.4396 3168.1312 3562.2923
redmass: 3.4720 4.3474 5.7765 3.1309 3.3967 2.5943 1.9375 2.0758 1.9110 2.0080 1.3876 3.4865 3.6019 3.2273 3.2616 4.8951 2.9813 3.9481 3.8726 2.4584 2.1017 2.5638 4.1178 2.7317 6.5074 2.1248 2.3893 3.6123 2.3121 1.8995 2.6404 1.3019 1.6094 2.5169 2.2344 2.0126 1.5514 1.3819 7.2578 1.9665 2.6467 1.6734 2.7026 2.2256 1.7379 1.2614 1.8463 1.9624 1.3456 1.5432 1.2436 1.6489 2.1427 3.0677 1.2544 1.5352 2.1493 1.3171 1.7592 1.4869 2.1023 4.4233 1.2288 3.7907 1.1721 1.0830 1.0501 1.0922 1.0710 1.0780 1.0533 1.0603 2.3407 7.1789 6.4150 8.9040 1.0330 1.0373 1.0591 1.0627 1.0635 1.0994 1.1040 1.0992 1.1012 1.1002 1.1023 1.0993 1.0879 1.0874 1.0946 1.0961 1.0780
irintensity: 2.0236 0.4417 2.9610 2.5671 3.6957 1.8074 1.1903 0.5652 0.2756 1.0712 0.0638 0.6240 0.5795 1.6995 3.2108 5.3582 0.4809 1.6668 10.2764 10.0951 24.0281 13.8378 29.3993 33.4878 6.1640 83.2671 3.3627 0.8346 23.5446 5.9705 3.0167 9.5726 62.9828 12.6376 10.5339 1.1617 2.0192 1.2711 32.9847 17.1674 15.1508 3.0407 3.5104 5.9534 3.1766 0.1729 19.9183 7.1008 0.7093 6.8619 103.6909 22.4356 49.2302 118.9956 3.7504 19.0473 119.1827 7.0323 18.5421 4.4830 60.3790 19.0304 16.0497 2.0740 10.8237 2.3113 13.2795 34.5662 44.4519 7.4729 8.8906 13.7402 106.7661 8.5117 58.6144 503.4245 66.1543 35.8289 18.1850 17.9972 16.2177 26.8214 48.3746 36.4287 12.1468 46.9812 27.4615 27.6439 4.3780 13.1838 14.9119 6.1598 16.5562
temp: 298.150 k
press: 1.00000 atm
elementType: 8 8 7 6 6 6 6 6 6 6 6 6 6 6 6 6 1 1 1 1 1 1 1 1 1 1 1 1 1 1 1 1 1
symmnumber: 1
zpe: 721366.8 jmol-1
zpe.correction: 0.274754 hartree
zpe.thermalcorrener: 0.290253 hartree
zpe.thermalcorrenthalpy: 0.291197 hartree
zpe.thermalcorrgfe: 0.231654 hartree
zpe.sumelectzpe: -709.588676 hartree
zpe.sumelectthermal: -709.573178 hartree
zpe.sumelectthermalent: -709.572234 hartree
zpe.sumelectthermalfe: -709.631777 hartree
dipole: -3.3906 1.5278 1.2587
dipole: 3.9262
quadrupole: -103.0630 -95.0481 -95.3349
quadrupole: 21.5707 11.2531 -1.5866
quadrupole: -5.2477 2.7672 2.4805 21.5707 11.2531 -1.5866
hfenergy: -709.8634305 hartree
pointgroup: C01 [X(C13H17N1O2)]
dipole: 1.345784 0.5483968 -0.523621 debye
polarizability: 206.7433899|2.139035|141.9646366|1.9652164|-12.279749|108.7635811 unknown
InChI: InChI=1S/C13H17NO2/c1-3-13(9-8-12(15)14-13)10-4-6-11(16-2)7-5-10/h4-7,14H,3,8-9H2,1-2H3
charge 0 multiplicity 1
33 atoms
O  -3.860163 -1.805982 1.16517
O  4.43027 -0.023884 0.020735
N  -2.010168 -0.368662 0.885001
C  -1.341495 0.481732 -0.134476
C  -1.884332 -0.182267 -1.462768
C  -1.859961 1.950538 -0.02123
C  -3.225587 -0.849811 -1.071972
C  0.190579 0.361156 -0.034968
C  -3.107449 -1.096399 0.443112
C  -1.58882 2.630679 1.337169
C  1.062481 1.395912 -0.470228
C  0.780369 -0.840613 0.42758
C  2.459965 1.238027 -0.440959
C  2.181033 -1.018401 0.468183
C  3.028135 0.02892 0.030232
C  5.063386 -1.258695 0.49039
H  -1.164443 -0.946175 -1.802674
H  -1.984155 0.569907 -2.263448
H  -2.951614 1.929229 -0.208155
H  -1.420841 2.552404 -0.839994
H  -3.418761 -1.800717 -1.594201
H  -4.098693 -0.194625 -1.249613
H  -1.779729 -0.312801 1.878288
H  -2.098604 2.097405 2.16084
H  -0.508964 2.665777 1.56677
H  -1.968924 3.668131 1.335081
H  0.656509 2.34246 -0.841429
H  0.130542 -1.657079 0.762132
H  3.12974 2.035999 -0.775817
H  2.591469 -1.963194 0.837162
H  4.811986 -1.463396 1.549387
H  6.144509 -1.081434 0.394068
H  4.770228 -2.124737 -0.134566
