program: Gaussian 09
title: 000201510
version: EM64L-G09RevD.01
frameworkgroup: C1[X(C13H17NO)]
method: RPBEPBE
basis: SDD
operation: Freq
keyword: #p
keyword: freq=noraman
keyword: PBEPBE/SDD
title: #p freq=noraman PBEPBE/SDD
converged: YES YES NO NO
title: Mulliken charges:
elementType: O N C C C C C C C C C C C C C H H H H H H H H H H H H H H H H H
charge: -0.244846 -0.447815 0.295679 -0.089563 -0.530105 -0.521809 0.418593 0.104204 -0.724702 -0.730481 -0.380169 -0.424505 -0.248087 -0.222755 -0.246142 0.197635 0.251293 0.229641 0.253721 0.249973 0.313717 0.217144 0.218968 0.230063 0.202762 0.220484 0.244090 0.222367 0.257428 0.225158 0.227338 0.230718
chargesum: 0.00000
title: Mulliken charges with hydrogens summed into heavy atoms:
elementType: O N C C C C C C C C C C C C C
charge: -0.244846 -0.134098 0.295679 0.108072 -0.049170 -0.018115 0.418593 0.104204 -0.058527 -0.063145 -0.157801 -0.167077 -0.022929 0.004583 -0.015424
polarizability: 1.79589674e+02 -3.77338492e+00 1.35141810e+02 -8.57054023e-02 1.45377026e+01 1.12388974e+02
1716.lowfreq: -7.1143 -0.0002 0.0002 0.0009 6.7505 18.5309 29.4793 62.1834 74.2153
frequency: 28.7992 62.0986 74.1625 99.5329 142.5979 163.0815 209.6340 233.7700 256.6326 277.6151 303.4399 315.8564 344.6218 368.4712 402.5807 426.9808 489.7248 509.0740 528.9341 567.8247 615.6604 621.7796 642.4850 664.0486 707.3764 751.2404 769.0195 807.6712 856.0179 859.2737 888.7173 911.8125 922.1563 928.6913 956.4977 977.9271 982.5957 989.1887 998.9605 1005.5494 1027.2072 1046.9056 1068.0721 1083.9696 1124.0332 1140.6804 1164.6025 1173.4830 1181.2412 1195.2115 1212.5001 1225.3364 1269.1369 1280.3721 1294.8379 1306.7061 1320.8064 1332.5126 1367.6808 1377.8752 1381.3302 1399.6477 1433.9004 1452.0115 1470.4447 1472.2268 1480.6134 1481.4863 1491.1048 1493.8408 1589.2607 1611.2653 1659.2990 2974.1933 2980.1945 2987.4602 3020.0090 3028.4835 3063.8365 3071.6310 3075.6052 3078.6151 3084.0695 3094.8997 3120.6711 3127.9990 3140.5043 3149.6014 3164.6433 3562.1298
redmass: 3.7713 4.2008 3.4012 3.5068 2.4750 3.4256 1.0820 2.4978 1.1675 3.2571 3.0133 5.1319 3.8355 3.2004 2.8347 2.8990 3.7424 1.7227 3.0358 2.6368 6.0446 4.2396 2.8837 2.3551 1.7499 2.0670 1.8942 3.1806 1.2505 2.6935 3.0197 1.2604 1.4979 1.9224 1.4486 1.8834 1.6077 5.7359 1.3288 2.1497 2.2162 1.9625 2.5207 1.6588 2.0941 2.0198 1.7820 1.0554 1.7005 1.1775 1.9923 2.0750 1.4151 1.7287 1.4970 1.5640 1.4266 1.7305 1.8528 5.7955 1.2684 1.2124 2.2351 1.0785 1.0582 1.0582 1.0659 2.1921 1.0570 1.0533 6.0621 6.1049 8.7375 1.0376 1.0363 1.0816 1.0598 1.0636 1.0977 1.0989 1.1024 1.0998 1.0997 1.1029 1.0851 1.0869 1.0922 1.0951 1.1014 1.0775
irintensity: 0.2207 1.5354 0.6440 0.7944 0.4869 0.3214 0.2135 0.5116 0.2059 0.7306 0.3924 0.0242 1.2893 0.8020 0.2277 4.0019 10.1772 30.1353 3.1732 4.6780 2.7506 21.2499 31.6441 91.6821 43.2548 8.4055 53.0265 2.4996 0.6453 4.5792 0.4211 2.6246 5.1737 10.0577 1.0807 1.9878 2.2528 0.9640 0.8748 7.3845 15.5422 9.0178 4.0148 7.5239 2.7153 15.0319 1.5312 0.3173 13.6725 5.1255 12.9202 19.1169 18.8337 70.3506 26.0920 18.5392 11.3037 8.8413 53.4005 4.6409 7.0016 20.7691 10.4155 5.2221 1.9658 1.5675 8.7118 18.7081 12.7953 22.6975 0.3992 10.5987 496.6727 25.3916 30.1428 18.0749 21.8686 14.9562 19.8554 45.1699 3.4549 39.5826 37.0828 25.9251 5.7456 0.5058 21.7487 31.5491 22.8915 15.9745
temp: 298.150 k
press: 1.00000 atm
elementType: 8 7 6 6 6 6 6 6 6 6 6 6 6 6 6 1 1 1 1 1 1 1 1 1 1 1 1 1 1 1 1 1
symmnumber: 1
zpe: 711755.6 jmol-1
zpe.correction: 0.271093 hartree
zpe.thermalcorrener: 0.285263 hartree
zpe.thermalcorrenthalpy: 0.286207 hartree
zpe.thermalcorrgfe: 0.229976 hartree
zpe.sumelectzpe: -634.458665 hartree
zpe.sumelectthermal: -634.444495 hartree
zpe.sumelectthermalent: -634.443551 hartree
zpe.sumelectthermalfe: -634.499782 hartree
dipole: -3.0427 3.0572 1.6058
dipole: 4.6025
quadrupole: -97.4535 -93.0897 -88.0886
quadrupole: 11.1630 5.7310 -0.4891
quadrupole: -4.5763 -0.2124 4.7887 11.1630 5.7310 -0.4891
hfenergy: -634.7297583 hartree
pointgroup: C01 [X(C13H17N1O1)]
dipole: 1.1783138 -1.1646921 0.7307061 debye
polarizability: 179.4582244|-4.490163|132.6932493|0.1778364|-16.23601|114.9689849 unknown
InChI: InChI=1S/C13H17NO/c1-10(2)13(9-8-12(15)14-13)11-6-4-3-5-7-11/h3-7,10,14H,8-9H2,1-2H3
charge 0 multiplicity 1
32 atoms
O  -3.106261 1.950857 -1.05094
N  -1.274173 0.485382 -0.830758
C  -0.512637 -0.299206 0.165448
C  -0.864471 -1.832537 0.038458
C  -1.02988 0.335715 1.522832
C  -2.327498 1.109627 1.182668
C  1.009283 -0.060461 0.034342
C  -2.316109 1.264756 -0.346517
C  -2.364344 -2.128181 0.275232
C  -0.423999 -2.41312 -1.32865
C  1.933541 -0.859312 0.759812
C  1.520574 1.00441 -0.749797
C  3.321666 -0.610535 0.691356
C  2.910281 1.253792 -0.824011
C  3.819521 0.445691 -0.106206
H  -0.29219 -2.354787 0.831541
H  -0.263172 1.03068 1.903267
H  -1.177345 -0.445393 2.28732
H  -2.382816 2.104149 1.655367
H  -3.245369 0.562416 1.463178
H  -1.132327 0.374896 -1.83592
H  -2.550553 -3.213876 0.182598
H  -2.704777 -1.820753 1.280516
H  -2.995393 -1.616443 -0.474434
H  -1.023549 -1.985386 -2.155498
H  -0.582102 -3.506661 -1.348828
H  0.643102 -2.220371 -1.535942
H  1.576467 -1.680616 1.391364
H  0.825786 1.652243 -1.294663
H  4.014072 -1.241037 1.260831
H  3.279918 2.081673 -1.439777
H  4.896758 0.637285 -0.162486
