program: Gaussian 09
title: 000201493
version: EM64L-G09RevD.01
frameworkgroup: C1[X(C9H10N2O3)]
method: RPBEPBE
basis: SDD
operation: Freq
keyword: #p
keyword: freq=noraman
keyword: PBEPBE/SDD
title: #p freq=noraman PBEPBE/SDD
converged: YES YES NO NO
title: Mulliken charges:
elementType: O O O N N C C C C C C C C C H H H H H H H H H H
charge: -0.307443 -0.188151 -0.217724 -0.431676 -0.643537 0.366138 -0.447207 -0.334873 -0.388558 0.218112 -0.223226 -0.192894 -0.253692 0.290486 0.271366 0.250929 0.259899 0.257431 0.232944 0.233080 0.234110 0.347906 0.348838 0.317740
chargesum: 0.00000
title: Mulliken charges with hydrogens summed into heavy atoms:
elementType: O O O N N C C C C C C C C C
charge: -0.307443 -0.188151 -0.217724 -0.083770 0.023041 0.366138 0.075088 -0.074973 -0.131127 0.218112 0.009719 0.040186 -0.019582 0.290486
polarizability: 1.38153082e+02 2.22511571e+01 1.05732879e+02 -3.60024837e+00 -6.68365838e+00 1.04732798e+02
1716.lowfreq: -8.7823 -5.6001 -0.0007 -0.0006 0.0006 6.3575 29.6221 36.0266 42.1146
frequency: 29.5667 35.9714 42.1017 56.5639 123.5941 142.1026 193.9433 246.3594 271.9273 336.5078 393.4640 411.2939 427.0222 475.5349 500.4862 511.4067 549.8201 556.6226 578.3025 612.6176 659.7019 693.6338 712.2389 730.3350 758.0943 760.9339 829.5100 886.2257 899.1425 963.9874 966.6666 980.2729 988.3653 990.0723 1004.6479 1023.4835 1059.0099 1084.9528 1166.3185 1176.2248 1185.1342 1194.6972 1232.2144 1300.5258 1314.6484 1325.6059 1385.7785 1440.2469 1447.7467 1456.0122 1479.8274 1594.4743 1608.0220 1610.9978 1648.7639 1701.5210 3024.7327 3095.3956 3133.8944 3141.9083 3156.7862 3164.4448 3175.0673 3462.8133 3531.2071 3686.0768
redmass: 6.4560 4.9316 5.1228 5.8437 5.1718 6.0382 5.6712 3.9411 5.7333 4.1696 2.0310 2.9320 1.6935 4.5618 3.2816 3.5203 1.6234 2.7412 3.7042 6.4384 4.0282 2.1817 1.8032 2.3092 5.4658 1.5542 1.2449 4.7128 1.4092 5.5975 1.3690 5.9630 1.3948 4.9965 2.2497 2.0630 1.9757 1.5341 1.2919 1.4568 1.7429 1.7274 1.2908 3.4301 1.3277 1.3093 8.7343 1.7266 1.4365 1.7999 2.2591 6.2761 4.4462 1.3082 5.2520 7.5398 1.0577 1.1067 1.0850 1.0889 1.0924 1.0961 1.1013 1.0762 1.0458 1.1042
irintensity: 0.6433 15.5558 0.7897 3.7924 7.0158 3.1276 0.2333 3.8649 10.1989 1.2113 24.5963 0.1141 53.3570 37.2919 1.5008 10.3347 174.7892 36.5659 14.5240 0.8343 2.9112 32.6431 35.9732 126.9518 42.9048 85.9300 0.5296 13.6775 7.8835 7.7192 0.1563 21.2352 2.2440 24.4281 11.5316 19.5236 10.5880 12.1339 52.5344 78.7750 67.6682 63.5218 72.9801 139.0833 2.1947 33.8460 6.3234 33.9617 202.1057 441.8929 152.9919 24.7131 60.9349 33.1706 15.4546 444.9617 17.2140 6.7019 1.6657 8.2680 21.3290 14.5826 7.5559 54.2432 40.7102 37.6418
temp: 298.150 k
press: 1.00000 atm
elementType: 8 8 8 7 7 6 6 6 6 6 6 6 6 6 1 1 1 1 1 1 1 1 1 1
symmnumber: 1
zpe: 480465.6 jmol-1
zpe.correction: 0.183000 hartree
zpe.thermalcorrener: 0.196080 hartree
zpe.thermalcorrenthalpy: 0.197024 hartree
zpe.thermalcorrgfe: 0.141157 hartree
zpe.sumelectzpe: -683.118676 hartree
zpe.sumelectthermal: -683.105596 hartree
zpe.sumelectthermalent: -683.104651 hartree
zpe.sumelectthermalfe: -683.160519 hartree
dipole: 4.9981 3.5083 -2.4806
dipole: 6.5911
quadrupole: -98.3923 -71.5540 -79.7409
quadrupole: -5.5147 10.2750 0.7320
quadrupole: -15.1632 11.6751 3.4882 -5.5147 10.2750 0.7320
hfenergy: -683.3016758 hartree
pointgroup: C01 [X(C9H10N2O3)]
dipole: -1.5594783 1.4029674 -1.5244651 debye
dipolederiv: -1.3485516 0.0178401 -0.5551655 -0.0862207 -0.349518 -0.1348138 -0.6620169 -0.0324109 -0.7853555 -0.4988566 0.1533547 -0.1219992 0.0883347 -0.6232647 0.4445738 0.1240332 0.1780968 -0.6812493 -0.8847562 0.2758242 -0.082725 0.3621331 -0.5169196 0.0623663 -0.0091665 0.0941347 -0.5805076 -1.2540675 -0.0099872 0.687657 0.1573458 -0.4048784 0.0442601 0.7300282 0.1416385 -1.2598518 -0.4110508 -0.1754745 0.0442368 -0.1878525 -0.7618582 0.2045201 0.1306938 0.1977887 -1.1382773 0.9910013 0.1268248 0.5602663 0.4301912 0.1315389 0.2918275 0.7043139 0.1073146 0.511515 0.4670923 -0.0210212 0.2507712 -0.1822667 0.1589818 -0.2545237 0.4443034 -0.1004159 0.4105121 -0.2480333 -0.017357 -0.0303921 -0.2748148 -0.120593 -0.1706948 -0.0033021 -0.0019103 -0.1861815 -0.3142677 -0.0398204 -0.0615902 0.0854746 0.0474795 0.0617316 -0.1272192 -0.0315773 -0.2493321 0.7727325 -0.1912225 -0.2158191 -0.0716262 0.7510346 -0.6435335 -0.6807864 -0.4091589 1.2684738 0.0154917 -0.0257692 0.1205942 0.0608545 0.1495392 0.0165812 0.1357074 -0.0464935 -0.0275385 0.0277232 0.0057303 0.1378889 -0.0140462 0.1283802 -0.039315 0.1403215 -0.0099063 -0.0197673 -0.0922239 0.0736099 0.0930738 0.0369332 -0.1656694 0.0325373 0.0740912 0.056284 -0.1098979 1.6305721 -0.3822559 -0.4472971 -0.6703632 0.6842683 -0.1343311 -0.483485 -0.3630784 1.7430838 0.0067384 -0.0071925 -0.0810172 0.0034855 0.0323168 -0.0754085 -0.0768837 -0.0345735 0.0196855 -0.0404189 -0.0360025 0.051358 -0.0041531 0.0128669 0.1307972 0.0037781 0.0325096 0.0673269 0.0799267 0.0581583 -0.090252 0.0873669 0.0458699 0.0510946 -0.0917443 0.0541386 0.0845138 0.1324979 -0.0437565 -0.0366444 -0.0375056 -0.0465877 -0.0192312 -0.0408993 -0.0259154 0.1351739 0.1043358 -0.0289567 -0.0388541 -0.049187 -0.0948606 -0.0189461 -0.0454633 -0.0081951 0.1192967 0.0448826 0.0712425 -0.0930281 0.0760009 -0.0004663 0.0727694 -0.0976452 0.0741696 0.072073 0.0091679 -0.0513477 -0.1299863 -0.0522342 0.0677482 -0.0373679 -0.1369695 -0.0339965 0.0610484 0.4208812 0.0557445 0.0463093 0.0495903 0.2079092 0.045676 -0.021481 0.0671939 0.1309144 0.2247554 0.089616 0.0003518 0.0850653 0.3288034 0.0509328 0.0168138 0.0394592 0.2165012 0.1644273 0.1022186 -0.007737 0.1074941 0.337879 0.0184973 -0.0270222 0.0549038 0.1978401 unknown
polarizability: 128.7493941|-8.8539818|108.6762293|24.2320998|-11.3611369|111.1931353 unknown
InChI: InChI=1S/C9H10N2O3/c10-9(13)11-8(12)6-14-7-4-2-1-3-5-7/h1-5,11H,6,10H2
charge 0 multiplicity 1
24 atoms
O  -0.365055 0.796314 1.235171
O  1.927335 -1.906623 2.195345
O  3.989854 -1.522865 0.060841
N  1.941662 -0.354792 0.397282
N  3.037648 -0.28121 -1.669429
C  -1.3787 0.222348 0.420211
C  0.312734 -0.077117 2.20498
C  -1.617213 -1.168164 0.309268
C  -2.152451 1.154409 -0.310558
C  1.479702 -0.89762 1.601444
C  -2.651813 -1.61697 -0.545858
C  -3.175675 0.688591 -1.161398
C  -3.432068 -0.699199 -1.282697
C  3.068348 -0.793129 -0.373564
H  0.726453 0.610396 2.962628
H  -0.390588 -0.770522 2.69827
H  -1.017527 -1.900273 0.858865
H  -1.948341 2.222923 -0.190615
H  -2.839445 -2.69262 -0.634256
H  -3.778345 1.410235 -1.72362
H  -4.230281 -1.057581 -1.94071
H  1.402666 0.455549 0.067907
H  3.830455 -0.503834 -2.267737
H  2.217244 0.159054 -2.082467
