program: Gaussian 09
title: 000201474
version: EM64L-G09RevD.01
frameworkgroup: C1[X(C9H11NO3)]
method: RPBEPBE
basis: SDD
operation: Freq
keyword: #p
keyword: freq=noraman
keyword: PBEPBE/SDD
title: #p freq=noraman PBEPBE/SDD
converged: NO YES NO NO
title: Mulliken charges:
elementType: O O O N C C C C C C C C C H H H H H H H H H H H
charge: -0.280455 -0.420326 -0.354485 -0.688770 0.060368 0.201593 -0.312140 0.568400 -0.555215 -0.443045 0.245359 -0.217890 -0.674137 0.261280 0.246362 0.220255 0.230052 0.229762 0.212189 0.229991 0.230064 0.312228 0.314762 0.383800
chargesum: 0.00000
title: Mulliken charges with hydrogens summed into heavy atoms:
elementType: O O O N C C C C C C C C C
charge: -0.280455 -0.036526 -0.354485 -0.061779 0.060368 0.201593 -0.050861 0.568400 -0.308853 -0.222789 0.245359 0.241924 -0.001895
polarizability: 1.99240627e+02 -1.39517626e+01 1.24474681e+02 7.22446057e-02 3.59967805e-02 5.71351097e+01
1716.lowfreq: -0.0006 -0.0004 0.0006 5.8223 11.1544 15.8200 46.9348 72.8595 100.7737
frequency: 46.6768 72.8360 100.7713 117.9145 133.2760 223.6739 244.3067 257.3122 281.0455 290.1264 341.3582 384.1764 411.0851 431.6038 436.4177 455.7500 502.3023 572.5354 609.6186 629.7461 675.2214 735.0187 743.1578 787.6827 799.0214 808.0726 838.7695 854.0495 878.3194 950.0845 962.3270 1017.5875 1037.5572 1069.7409 1111.8701 1135.6208 1147.3054 1198.6774 1228.2242 1249.2882 1277.7823 1344.4307 1357.5499 1394.3391 1405.4014 1413.6730 1446.2101 1464.1148 1473.6696 1486.8101 1506.2774 1569.3076 1579.0865 1643.5065 1664.2633 2942.1685 2996.7694 3013.6374 3071.8498 3093.1957 3109.5414 3133.0807 3156.5563 3169.2270 3562.0984 3702.8681
redmass: 2.7881 2.4708 3.8731 9.8132 3.1416 4.9858 1.2651 4.2207 4.9682 4.6063 3.4187 6.4780 1.1248 1.1562 5.4771 2.7305 5.0137 5.3171 6.6744 6.3688 3.1267 6.8296 3.2591 6.0973 1.1077 1.5663 3.9355 1.8655 1.0817 2.7693 1.3310 2.3352 1.6747 4.0063 2.2225 1.4574 1.4707 2.0531 1.6298 1.1344 2.1961 2.3890 1.5911 1.8536 1.6077 3.4468 5.8714 1.0401 1.0611 1.0897 3.8850 7.2080 3.0494 1.1923 5.0706 1.0699 1.0359 1.0583 1.1066 1.0984 1.1028 1.0890 1.0920 1.0957 1.0451 1.1041
irintensity: 0.0273 4.7470 2.0835 1.0591 0.7966 2.3490 0.0038 3.8439 2.3807 7.8455 7.9445 21.9620 128.7812 169.5986 6.9446 7.8275 8.8285 0.7692 13.4402 0.0878 17.9510 1.9712 0.3107 10.9287 0.8150 29.6071 16.9472 105.6124 101.6278 18.1463 0.0718 15.3773 37.0999 275.5536 1.7534 5.5348 163.7942 56.0015 98.3631 0.0045 415.1256 84.2226 33.0170 247.5493 80.7364 105.0938 123.2721 12.1071 4.2837 16.5437 65.9743 144.0857 11.7777 108.0869 621.0672 320.1583 21.0583 23.4014 7.2794 31.7064 45.6499 12.5777 8.3428 6.4032 113.9016 24.6050
temp: 298.150 k
press: 1.00000 atm
elementType: 8 8 8 7 6 6 6 6 6 6 6 6 6 1 1 1 1 1 1 1 1 1 1 1
symmnumber: 1
zpe: 494940.2 jmol-1
zpe.correction: 0.188513 hartree
zpe.thermalcorrener: 0.201092 hartree
zpe.thermalcorrenthalpy: 0.202037 hartree
zpe.thermalcorrgfe: 0.149531 hartree
zpe.sumelectzpe: -629.042707 hartree
zpe.sumelectthermal: -629.030127 hartree
zpe.sumelectthermalent: -629.029183 hartree
zpe.sumelectthermalfe: -629.081689 hartree
dipole: 1.5220 -3.8474 -0.0071
dipole: 4.1375
quadrupole: -44.2972 -78.6911 -79.7925
quadrupole: -4.5704 0.0262 -0.0179
quadrupole: 23.2964 -11.0975 -12.1989 -4.5704 0.0262 -0.0179
hfenergy: -629.2312199 hartree
pointgroup: C01 [X(C9H11N1O3)]
dipole: 0.6265702 -1.5023979 0.0047041 debye
dipolederiv: -1.9213435 -0.3598434 -0.0250393 -0.9334473 -0.6341919 -0.0150219 -0.0231845 -0.0053684 -0.277526 -0.5664104 0.2273023 -0.001437 0.1760581 -1.1850009 0.0019444 -0.002058 0.0026272 -0.4010674 -1.0007762 0.2022086 -0.0098704 0.3234308 -1.0958963 0.0041378 -0.0067823 0.0005962 -0.3527494 -1.7182397 0.4527022 -0.014642 0.3732091 -0.2401511 0.0070093 -0.0149078 0.0081898 -0.7206445 -1.4577525 0.0721789 -0.0203876 0.3808365 -0.5121764 0.0052124 -0.0204439 0.0001346 -0.1157638 0.9219153 -0.4022826 0.0118199 -0.0058649 1.0706719 0.0009727 0.012541 -0.0053474 0.1289067 0.5994323 -0.1910518 0.0098116 -0.5751475 0.2582631 -0.0081869 0.0085363 -0.0022975 -0.0547589 1.8443937 -0.4476687 0.0253599 -0.23832 0.4906746 -0.0031178 0.0261827 -0.006358 0.1756827 -0.532712 0.4060212 -0.0033216 0.5512761 -0.3832529 0.0086024 -0.0029371 0.0065275 -0.2762802 -0.9021441 0.1209713 -0.009499 -0.3306659 0.0177121 -0.0045257 -0.0108343 0.0025334 -0.2715276 2.6769178 -0.11732 0.0368362 0.3277049 1.266967 0.0067296 0.0356238 0.0012926 0.2457508 1.1865009 0.1463151 0.0127138 0.024887 0.2575068 -0.0000082 0.0112322 0.001309 0.3541906 -0.0879729 -0.0959291 -0.0019828 -0.0721377 -0.0430647 -0.0003202 -0.0019583 -0.0006714 0.0619743 0.068367 -0.0860832 -0.001465 -0.0745698 0.0249549 -0.0014434 -0.0013858 -0.001664 0.1438637 -0.033202 -0.0721162 -0.0036008 -0.0771688 0.0134824 -0.0016188 -0.0036145 -0.0014536 0.1856353 0.0200316 0.0808271 -0.0022953 0.0710891 -0.1020148 0.0004743 -0.0022578 0.0007068 0.1774167 -0.0826153 -0.0316612 -0.0015155 0.0571354 0.0038114 -0.0915585 0.0409396 -0.0937265 -0.0575184 -0.0829473 -0.0342402 0.0004501 0.0541292 0.0045482 0.0932557 -0.0422661 0.0931087 -0.0605549 -0.188833 0.0239838 -0.0044024 0.0410609 0.068103 0.0006602 -0.0043988 0.000451 0.1157637 0.1197308 0.0448941 0.059362 -0.0159238 0.0067873 -0.0934807 0.0311718 -0.1084309 -0.0619433 0.1222454 0.0414915 -0.0544401 -0.0184778 0.0082543 0.0924333 -0.0260438 0.1090082 -0.0656374 0.2181392 -0.0367105 -0.0027578 -0.0894645 0.1519949 -0.0019232 -0.003015 -0.0010825 0.3849457 0.2461008 -0.0220943 -0.0022832 0.0382847 0.1071186 -0.0000471 -0.0021125 -0.0009885 0.384639 0.5511743 0.0781052 0.0025864 0.0120863 0.4448983 -0.0001798 0.001973 0.0009036 0.3572023 unknown
polarizability: 199.6954381|-12.567057|123.9863765|2.179571|-0.0677772|57.168603 unknown
InChI: InChI=1S/C9H11NO3/c1-2-13-9(12)7-4-3-6(10)5-8(7)11/h3-5,11H,2,10H2,1H3
charge 0 multiplicity 1
24 atoms
O  -2.246162 -0.568681 -0.09959
O  0.753554 2.437086 -0.048502
O  -1.718392 1.700521 -0.085652
N  4.182078 -0.964016 -0.000369
C  0.067917 0.070953 -0.063529
C  1.083399 1.09631 -0.045162
C  0.482669 -1.292053 -0.06016
C  2.838008 -0.615183 -0.020943
C  2.447289 0.748729 -0.023966
C  1.833342 -1.641871 -0.039509
C  -1.330748 0.474209 -0.084779
C  -3.689327 -0.177596 -0.120475
C  -4.49212 -1.474433 -0.126829
H  -0.28931 -2.067178 -0.074311
H  3.188379 1.554093 -0.01044
H  2.133995 -2.695676 -0.037161
H  -3.894142 0.445183 0.76871
H  -3.869927 0.43899 -1.019129
H  -5.572492 -1.241519 -0.142461
H  -4.255042 -2.081238 -1.01731
H  -4.279428 -2.074766 0.77408
H  4.466524 -1.93928 0.002056
H  4.905805 -0.250947 0.012855
H  -0.269871 2.504265 -0.067125
