program: Gaussian 09
title: 000201491
version: EM64L-G09RevD.01
frameworkgroup: C1[X(C17H13ClO2)]
method: RPBEPBE
basis: SDD
operation: Freq
keyword: #p
keyword: freq=noraman
keyword: PBEPBE/SDD
title: #p freq=noraman PBEPBE/SDD
converged: YES YES NO NO
title: Mulliken charges:
elementType: Cl O O C C C C C C C C C C C C C C C C C H H H H H H H H H H H H H
charge: -0.067223 -0.392674 -0.363093 0.191289 0.129063 -0.273349 0.480575 0.196425 -0.339997 -0.163920 -0.202067 -0.300062 -0.321443 -0.379712 -0.386521 -0.213417 -0.151396 -0.234966 -0.235606 -0.233598 0.244636 0.262924 0.259293 0.229591 0.219831 0.227470 0.234341 0.225198 0.270194 0.231950 0.233759 0.235711 0.386794
chargesum: 0.00000
title: Mulliken charges with hydrogens summed into heavy atoms:
elementType: Cl O O C C C C C C C C C C C C C C C C C
charge: -0.067223 -0.005879 -0.363093 0.191289 0.129063 -0.028713 0.480575 0.196425 -0.077073 -0.163920 0.057226 -0.070471 -0.101612 -0.152242 -0.152180 0.011780 0.118797 -0.003016 -0.001847 0.002113
polarizability: 5.82127234e+02 1.67697758e+01 2.24629774e+02 1.41889265e-01 -2.12419699e-01 7.49639361e+01
1716.lowfreq: -4.2801 0.0014 0.0016 0.0019 2.7033 5.2440 23.8348 29.7260 29.8980
frequency: 23.8191 29.6862 29.8437 67.9732 92.7707 104.9968 140.3470 152.5320 152.6352 196.4839 217.5723 257.2294 291.5449 324.8441 331.8843 349.6187 380.6934 389.5964 402.2536 436.4171 443.4435 502.3928 506.8356 515.3792 520.3392 613.7709 615.9711 628.8691 669.8791 692.3754 695.9426 744.0769 771.3476 790.2800 825.8279 834.3948 844.6536 854.7243 869.4381 870.0791 904.2591 930.5462 956.8081 958.3951 981.4543 987.5832 1000.1931 1000.7536 1022.9871 1023.2334 1026.2742 1077.4736 1084.2036 1128.4250 1173.7732 1176.9136 1192.2289 1205.4982 1230.1005 1237.2686 1263.3045 1275.4858 1294.5294 1302.2135 1309.1280 1336.2346 1353.6960 1386.9571 1398.4363 1403.5902 1442.5625 1461.9229 1483.9379 1521.9997 1572.5195 1578.2956 1598.4817 1610.5946 1624.2807 1627.7742 2553.6695 3087.9245 3100.4391 3112.4392 3123.4544 3131.0810 3142.9444 3149.5624 3154.1964 3160.8844 3169.0136 3177.4188 3182.9507
redmass: 3.8934 5.9506 7.2409 5.5858 3.7294 6.4035 6.0761 5.9984 7.4759 2.7152 7.3985 2.9350 5.3896 6.5680 2.9924 15.8721 5.6243 6.1457 2.7691 3.4397 9.8645 4.4507 2.7450 4.3561 3.3584 6.0527 5.8539 8.0541 4.6220 1.7088 7.2037 2.5599 1.8464 6.0029 1.5513 4.5589 1.3673 1.7308 6.5468 1.5427 1.5857 1.6243 1.2796 1.3340 1.3956 6.1611 1.3288 1.0690 1.1479 3.0647 2.3346 2.3752 1.6609 1.4890 1.5013 1.4902 1.1208 1.3082 1.6138 2.0417 2.0953 2.2984 1.7759 2.0621 1.4719 1.3871 2.4084 6.1308 7.1100 3.4775 2.3292 2.5027 2.2852 4.4809 3.3478 5.2339 5.2508 5.5269 5.2230 4.9831 1.0735 1.0909 1.0911 1.0885 1.0875 1.0862 1.0912 1.0903 1.0962 1.0890 1.1016 1.0910 1.0972
irintensity: 0.0054 0.1134 0.0370 0.2928 0.9161 0.2275 0.3685 0.1668 0.2745 0.9746 1.8969 0.7789 0.1922 0.5541 0.1556 4.2009 20.1197 9.3836 0.0027 1.2424 13.1604 23.9193 2.5445 1.0484 26.7604 0.5060 0.2963 36.9722 0.2455 49.2101 66.8436 1.8138 51.5338 15.4691 49.4136 5.7920 2.7002 14.6237 21.2066 9.4201 8.2300 0.6578 7.4243 0.4160 0.0681 2.7339 0.1056 126.0943 99.5295 45.3004 1.8102 17.9144 5.4695 2.1282 96.2855 103.9267 13.2920 16.4225 70.6118 35.6703 264.8838 49.5526 314.3400 91.8134 94.4733 7.8825 16.5118 48.8104 34.8689 238.8395 35.1459 346.8914 2.1467 215.0506 233.0730 6.7778 261.5668 11.3180 29.4666 456.7768 440.5158 5.5485 6.9237 16.2616 7.6930 1.5448 4.7481 6.0539 34.6224 0.7209 43.3365 4.2335 6.1810
temp: 298.150 k
press: 1.00000 atm
elementType: 17 8 8 6 6 6 6 6 6 6 6 6 6 6 6 6 6 6 6 6 1 1 1 1 1 1 1 1 1 1 1 1 1
symmnumber: 1
zpe: 649411.1 jmol-1
zpe.correction: 0.247348 hartree
zpe.thermalcorrener: 0.264759 hartree
zpe.thermalcorrenthalpy: 0.265704 hartree
zpe.thermalcorrgfe: 0.199364 hartree
zpe.sumelectzpe: -1264.722519 hartree
zpe.sumelectthermal: -1264.705107 hartree
zpe.sumelectthermalent: -1264.704163 hartree
zpe.sumelectthermalfe: -1264.770503 hartree
dipole: 5.2711 1.9842 0.0031
dipole: 5.6322
quadrupole: -96.7458 -127.9271 -130.8052
quadrupole: -1.1534 0.0252 -0.0918
quadrupole: 21.7469 -9.4344 -12.3125 -1.1534 0.0252 -0.0918
hfenergy: -1264.9698668 hartree
pointgroup: C01 [X(C17H13Cl1O2)]
dipole: -2.1013375 0.6688788 -0.2171345 debye
polarizability: 581.1484409|-15.4515242|191.5430982|-25.5518805|-60.9091488|109.029405 unknown
InChI: InChI=1S/C17H13ClO2/c18-14-10-11-17(20)15(12-14)16(19)9-5-4-8-13-6-2-1-3-7-13/h1-12,20H
charge 0 multiplicity 1
33 atoms
Cl 4.848755 2.885936 -2.005663
O  4.212451 -2.367643 0.843175
O  1.747946 -2.057265 0.84621
C  3.150296 -0.38084 -0.143604
C  4.317615 -1.165841 0.194865
C  3.33902 0.861926 -0.819897
C  -4.453434 -0.011697 0.16673
C  1.817931 -0.905861 0.227638
C  5.615299 -0.695393 -0.14582
C  4.627443 1.293304 -1.13929
C  5.775518 0.528686 -0.810396
C  -3.116947 -0.573324 0.375839
C  0.587655 -0.172322 -0.080177
C  -4.683472 1.242167 -0.476943
C  -5.584691 -0.749903 0.626463
C  -1.907026 -0.022329 0.005053
C  -0.648752 -0.676107 0.268993
C  -5.991453 1.731331 -0.650825
C  -6.894192 -0.259365 0.452093
C  -7.103901 0.984484 -0.188072
H  2.484238 1.484639 -1.093451
H  6.476548 -1.312408 0.123974
H  6.773052 0.892645 -1.073812
H  -3.086649 -1.547149 0.888271
H  0.65393 0.790795 -0.596175
H  -3.837144 1.834728 -0.840907
H  -5.42549 -1.715068 1.123167
H  -1.874046 0.947464 -0.510619
H  -0.663765 -1.647241 0.785442
H  -6.15084 2.695104 -1.1468
H  -7.748654 -0.842168 0.812519
H  -8.120157 1.369431 -0.325948
H  3.184119 -2.525117 0.99756
