program: Gaussian 09
title: 000201477
version: EM64L-G09RevD.01
frameworkgroup: C1[X(C15H19NO)]
method: RPBEPBE
basis: SDD
operation: Freq
keyword: #p
keyword: freq=noraman
keyword: PBEPBE/SDD
title: #p freq=noraman PBEPBE/SDD
converged: YES YES NO NO
title: Mulliken charges:
elementType: O N C C C C C C C C C C C C C C C H H H H H H H H H H H H H H H H H H H
charge: -0.277275 -0.067932 -0.464175 -0.445815 -0.428598 -0.430721 -0.414221 0.042453 -0.068170 -0.314155 -0.346955 0.380955 -0.407601 -0.378911 -0.217472 -0.228240 -0.241970 0.229136 0.221723 0.220426 0.230672 0.223597 0.222587 0.223266 0.246758 0.242362 0.220436 0.204075 0.203220 0.221897 0.219692 0.280361 0.224665 0.223901 0.223910 0.226118
chargesum: 0.00000
title: Mulliken charges with hydrogens summed into heavy atoms:
elementType: O N C C C C C C C C C C C C C C C
charge: -0.277275 -0.067932 -0.013317 0.005284 0.017585 0.039303 0.048577 0.042453 -0.068170 0.127435 0.060340 0.380955 -0.127239 -0.154247 0.006429 -0.004329 -0.015852
polarizability: 2.31710423e+02 1.53156759e+00 1.60280823e+02 -1.53245432e+01 -1.15497243e+01 1.12084952e+02
1716.lowfreq: -13.9019 -6.8969 -5.4087 -0.0008 -0.0006 -0.0003 3.2334 13.7004 20.5552
frequency: -8.5345 12.9839 19.3412 50.3231 55.1642 69.9698 73.7441 97.5796 134.8811 155.4134 204.0038 239.2546 267.5314 284.3459 355.6109 368.1525 369.8990 401.9780 456.7393 464.0851 536.0368 587.6994 616.2050 633.6712 636.3834 702.6094 738.4314 754.1733 784.3430 819.1540 830.5357 848.2953 856.6189 874.3332 904.2972 909.8480 918.3037 933.2382 968.3525 979.5239 982.1828 989.4295 997.3803 1008.1655 1023.3127 1025.0977 1032.9016 1043.0483 1065.2593 1083.7961 1103.9412 1170.2912 1171.0785 1179.9606 1184.6895 1187.3539 1193.4928 1203.6399 1214.4293 1217.2219 1238.1792 1244.2102 1281.1088 1297.0804 1301.1583 1307.2727 1316.1900 1333.1307 1352.6148 1378.4062 1398.1967 1439.2455 1455.1348 1457.0485 1464.8638 1471.8337 1473.5842 1474.9116 1485.9104 1489.3393 1595.0893 1618.7888 2290.2714 2851.8814 2897.0698 2911.2595 2937.5090 2949.7398 2993.8961 3001.1759 3002.9027 3006.4505 3019.0179 3054.7024 3069.0323 3080.2118 3092.3864 3108.8447 3125.2446 3139.0969 3157.8375 3176.4801
redmass: 3.5975 4.3350 3.3046 3.2420 3.7766 2.4104 2.5021 2.8775 4.5721 3.1156 3.0035 3.8450 3.3149 3.7304 3.5012 4.0736 2.4314 2.8418 4.7172 2.8591 5.9650 5.6652 6.3507 2.3259 2.8251 2.3370 1.3515 2.0307 4.1051 2.8646 1.6781 2.6152 1.2517 3.5578 2.5989 1.3347 8.2137 1.7121 1.8245 1.4123 1.5670 6.2628 1.3482 2.9563 3.1522 1.7872 3.1278 2.2004 2.2477 1.6323 2.5469 1.3042 1.0543 2.1541 1.1152 1.3339 1.0591 1.1056 2.3645 1.1583 1.2407 1.3493 1.3260 1.2325 1.3991 1.4026 1.2983 1.2726 1.4221 3.0789 2.1556 2.1316 1.0816 1.0928 1.0816 1.0806 1.0875 1.0835 2.2978 1.0940 6.1883 6.0349 11.7876 1.0696 1.0551 1.0539 1.1028 1.1044 1.0627 1.0653 1.0618 1.0837 1.0647 1.1009 1.1023 1.1026 1.1045 1.0875 1.0867 1.0931 1.0987 1.0959
irintensity: 0.0675 0.5693 0.9494 1.6327 0.9976 5.9053 8.9780 0.9003 2.6514 3.0347 2.0524 4.9353 1.6638 2.3997 0.6479 1.1525 2.9285 0.0807 6.6313 9.3013 1.0815 0.9270 0.0999 4.4670 4.3209 26.7821 87.1021 19.0155 0.0818 5.6516 2.8318 7.3228 0.1528 13.9324 0.4885 2.0102 33.8409 16.9087 2.3325 0.0394 1.0608 0.0650 0.5312 59.3082 111.5198 10.8670 78.5427 15.7017 14.8352 12.6375 1.6038 10.4733 0.1168 21.8469 2.7334 4.5416 0.7087 4.0517 0.8113 2.2750 14.5036 2.4307 6.0230 1.2893 49.0807 7.3239 13.4766 45.4499 28.2770 23.0762 10.5954 9.7348 7.2048 3.8482 2.3987 10.3006 13.5497 8.2476 16.3816 10.8643 1.6137 9.3600 10.4459 60.6197 33.1892 85.3990 64.0014 22.4024 42.4373 37.2380 53.0673 14.5946 41.6841 18.0535 7.1670 30.8741 78.9422 11.3519 1.3488 35.1912 32.9638 5.7678
temp: 298.150 k
press: 1.00000 atm
elementType: 8 7 6 6 6 6 6 6 6 6 6 6 6 6 6 6 6 1 1 1 1 1 1 1 1 1 1 1 1 1 1 1 1 1 1 1
symmnumber: 1
zpe: 793889.9 jmol-1
zpe.correction: 0.302377 hartree
zpe.thermalcorrener: 0.318615 hartree
zpe.thermalcorrenthalpy: 0.319559 hartree
zpe.thermalcorrgfe: 0.254647 hartree
zpe.sumelectzpe: -711.590602 hartree
zpe.sumelectthermal: -711.574364 hartree
zpe.sumelectthermalent: -711.573420 hartree
zpe.sumelectthermalfe: -711.638331 hartree
dipole: 0.4047 -0.3930 -0.1966
dipole: 0.5973
quadrupole: -88.1361 -94.0936 -102.4026
quadrupole: 9.3747 -6.4926 -1.4885
quadrupole: 6.7413 0.7839 -7.5252 9.3747 -6.4926 -1.4885
hfenergy: -711.8929787 hartree
pointgroup: C01 [X(C15H19N1O1)]
dipole: -0.1717192 0.1389641 -0.0801942 debye
polarizability: 233.0011071|6.3033315|162.5873002|4.5264257|5.9024479|108.4877909 unknown
InChI: InChI=1S/C15H19NO/c1-2-8-15(9-3-1)14-17-13-7-6-12-16-10-4-5-11-16/h1-3,8-9H,4-5,10-14H2
charge 0 multiplicity 1
36 atoms
O  1.210941 1.033058 -0.384967
N  -4.368335 0.344263 0.511119
C  -5.4982 -1.815725 0.211385
C  -4.184727 -2.05743 1.028553
C  -5.715243 -0.264471 0.290368
C  -3.713831 -0.618148 1.448548
C  -3.624186 0.510941 -0.778208
C  -2.281405 1.087871 -0.600479
C  -1.140141 1.538124 -0.476883
C  0.198544 2.106129 -0.312714
C  2.563226 1.571067 -0.213578
C  3.572739 0.441288 -0.330739
C  3.17739 -0.862852 -0.711212
C  4.941154 0.701586 -0.064831
C  4.140729 -1.892104 -0.825886
C  5.902487 -0.32601 -0.181531
C  5.504443 -1.629075 -0.563611
H  -5.374218 -2.141957 -0.83711
H  -6.35955 -2.366523 0.627866
H  -4.36277 -2.690296 1.915559
H  -3.420716 -2.563495 0.412368
H  -6.198649 0.161389 -0.605987
H  -6.34689 -0.018967 1.164922
H  -4.065568 -0.389592 2.471943
H  -2.619529 -0.487738 1.429165
H  -4.225698 1.184074 -1.419222
H  -3.507203 -0.447893 -1.345146
H  2.654536 2.066261 0.780533
H  2.763147 2.345688 -0.990711
H  0.27183 2.62373 0.670625
H  0.396344 2.860281 -1.108191
H  2.11911 -1.054956 -0.90744
H  5.258161 1.708992 0.235816
H  3.824553 -2.899721 -1.119543
H  6.957028 -0.112501 0.027113
H  6.248898 -2.428289 -0.653197
