program: Gaussian 09
title: 000201485
version: EM64L-G09RevD.01
frameworkgroup: C1[X(C19H23NO)]
method: RPBEPBE
basis: SDD
operation: Freq
keyword: #p
keyword: freq=noraman
keyword: PBEPBE/SDD
title: #p freq=noraman PBEPBE/SDD
converged: NO YES NO NO
title: Mulliken charges:
elementType: O N C C C C C C C C C C C C C C C C C C C H H H H H H H H H H H H H H H H H H H H H H H
charge: -0.460991 -0.020096 -0.036673 0.013642 -0.458388 -0.447996 -0.461315 -0.459039 0.313731 0.430656 -0.631890 -0.383993 -0.411969 -0.406917 -0.417951 -0.246454 -0.233996 -0.249772 -0.260096 -0.238845 -0.245191 0.197529 0.220908 0.233104 0.249351 0.217185 0.207683 0.207915 0.208112 0.208145 0.223213 0.222008 0.199487 0.344222 0.263461 0.224652 0.273886 0.250076 0.225240 0.224593 0.226738 0.227043 0.229818 0.229172
chargesum: 0.00000
title: Mulliken charges with hydrogens summed into heavy atoms:
elementType: O N C C C C C C C C C C C C C C C C C C C
charge: -0.116769 -0.020096 0.160855 0.013642 -0.004375 0.018540 -0.045717 -0.042782 0.313731 0.430656 0.012819 -0.120532 -0.187317 -0.133031 -0.167875 -0.021213 -0.009403 -0.023033 -0.033053 -0.009027 -0.016019
polarizability: 2.07408841e+02 -8.96203274e+00 2.35704479e+02 -1.47812575e+01 5.82928188e+00 1.75315145e+02
1716.lowfreq: -0.0006 -0.0005 0.0008 2.5992 11.3018 14.1812 29.1853 49.6601 53.7247
frequency: 28.4724 49.5743 53.6268 66.5458 79.5636 83.4954 134.8216 199.1727 204.4426 217.5156 230.8039 246.0013 253.3985 274.0981 285.7979 298.1863 352.2429 373.5897 404.0918 405.3295 411.1737 415.3771 426.1537 464.3918 472.6196 507.5631 538.7041 559.8633 616.1691 617.4496 630.3359 654.2919 705.9470 710.8376 726.8387 746.6595 761.4825 771.3985 806.1758 832.7687 853.3018 859.4555 871.5537 906.4037 924.2985 933.6437 947.3845 967.6331 970.1317 977.7668 982.4152 983.8803 989.6190 991.0685 995.7199 998.1852 1029.7354 1032.1792 1041.2498 1043.7730 1052.0542 1086.7441 1092.2076 1104.0114 1120.8846 1145.6753 1149.4985 1165.8709 1172.3570 1173.7710 1185.6087 1195.2891 1197.8028 1212.4479 1239.1087 1266.6564 1276.8279 1286.5046 1299.7951 1313.8319 1318.8781 1320.5588 1333.0800 1340.6005 1347.9471 1359.6770 1375.1636 1378.6440 1427.3038 1429.1264 1433.7115 1449.0794 1456.2251 1458.3026 1461.6960 1477.5858 1478.4803 1481.2665 1494.5064 1585.9644 1589.5833 1606.6640 1611.2181 2879.4352 2954.6188 2955.1466 2959.0213 2992.0909 2998.6276 3011.2793 3033.7712 3039.0583 3057.4684 3063.2863 3069.0280 3120.5548 3122.7963 3128.3828 3132.1249 3141.1931 3147.9771 3152.0162 3157.8125 3165.0676 3167.9201 3544.1859
redmass: 3.9928 4.0696 3.2854 3.7691 3.9460 4.0660 3.9129 3.3783 2.1220 1.1503 3.4252 4.2384 4.7490 3.7271 4.3806 3.4978 6.9082 1.2143 2.7836 2.1662 1.9785 2.1805 2.6215 3.8463 2.9991 3.1578 3.9208 2.5599 6.3419 6.3951 6.2074 4.3439 1.7225 1.7998 2.9979 3.7108 1.8363 2.2246 1.5316 2.4777 1.2604 1.2674 3.6421 1.6983 1.7798 1.6297 3.1982 1.9769 1.9744 1.4204 1.8946 2.0879 4.9047 3.7958 1.3335 1.3210 2.3510 2.1561 1.9006 2.1269 2.7596 1.6259 1.6296 2.2730 1.3925 2.1785 1.4059 2.6804 1.0552 1.0669 1.9199 1.1629 1.1227 2.6057 1.3666 1.3700 1.7645 1.5064 1.3068 1.3968 1.3247 1.3550 1.3638 1.3247 1.3089 1.4540 6.7572 6.9060 1.1370 2.2093 2.2404 1.0804 1.1019 1.0705 1.0825 1.9791 1.1309 2.1513 1.0509 5.9662 6.0186 6.0599 6.0989 1.0539 1.0687 1.0747 1.0661 1.0595 1.0609 1.0750 1.0977 1.0978 1.1034 1.1024 1.1006 1.0846 1.0846 1.0871 1.0886 1.0925 1.0929 1.0946 1.0954 1.1007 1.0989 1.0658
irintensity: 0.1080 0.4205 0.2114 0.6258 0.0353 0.0770 1.1956 0.5531 0.4086 0.1383 0.4870 7.2646 0.5741 7.3571 9.5691 11.1188 6.4648 120.5615 0.3190 4.3817 0.0986 19.2567 12.4969 2.0850 0.3380 4.5778 27.4242 25.1537 0.2256 0.1263 20.6034 5.8983 65.4721 39.1130 25.1932 8.7031 32.0263 24.2160 0.0274 7.3990 0.5262 0.0471 5.5610 1.1071 2.6323 5.6189 14.3802 17.5348 24.7090 0.8484 5.1860 12.5493 3.8194 1.2415 0.3930 0.4309 10.9970 3.1906 21.7114 11.2305 66.7444 2.1749 2.2713 1.4915 7.4990 5.1396 4.4973 2.9849 0.1073 0.1880 5.1786 1.8254 1.1228 7.4298 13.2604 16.7869 9.8633 55.0468 9.0488 7.2265 8.6408 6.0277 19.5207 6.5558 0.7220 3.4598 1.2421 1.3131 9.2165 5.5325 15.8212 7.5110 15.0252 6.1834 11.3783 25.9190 12.6385 12.3435 3.9750 0.5818 1.6722 8.8634 2.3154 92.0957 25.3027 21.6584 73.4133 23.2077 14.8961 74.5499 55.6702 34.0592 19.1784 55.4271 34.3767 5.1290 0.5705 1.5519 10.1564 28.7171 20.9713 26.7590 26.5749 23.0526 15.9108 7.4144
temp: 298.150 k
press: 1.00000 atm
elementType: 8 7 6 6 6 6 6 6 6 6 6 6 6 6 6 6 6 6 6 6 6 1 1 1 1 1 1 1 1 1 1 1 1 1 1 1 1 1 1 1 1 1 1 1
symmnumber: 1
zpe: 980109.1 jmol-1
zpe.correction: 0.373304 hartree
zpe.thermalcorrener: 0.392123 hartree
zpe.thermalcorrenthalpy: 0.393067 hartree
zpe.thermalcorrgfe: 0.326329 hartree
zpe.sumelectzpe: -866.222728 hartree
zpe.sumelectthermal: -866.203909 hartree
zpe.sumelectthermalent: -866.202964 hartree
zpe.sumelectthermalfe: -866.269703 hartree
dipole: 2.1493 0.5221 0.2682
dipole: 2.2280
quadrupole: -130.4357 -116.5786 -120.0732
quadrupole: -2.9455 -5.2534 2.4808
quadrupole: -8.0732 5.7839 2.2893 -2.9455 -5.2534 2.4808
hfenergy: -866.5960316 hartree
pointgroup: C01 [X(C19H23N1O1)]
dipole: -0.8469068 0.2196052 -0.053834 debye
polarizability: 205.5020811|8.4590453|234.8341248|-17.3390477|-8.2636802|178.0922593 unknown
InChI: InChI=1S/C19H23NO/c1-20-14-12-18(13-15-20)19(21,16-8-4-2-5-9-16)17-10-6-3-7-11-17/h2-11,18,21H,12-15H2,1H3
charge 0 multiplicity 1
44 atoms
O  0.074044 -0.003674 -1.927882
N  4.182468 -0.330536 0.302186
C  1.1858 -0.090712 0.215736
C  -0.227399 0.011577 -0.473526
C  2.111272 1.119933 -0.064554
C  1.919268 -1.400121 -0.182317
C  3.480295 0.929091 0.651485
C  3.293178 -1.495955 0.539336
C  -0.946233 1.347364 -0.13783
C  -1.109009 -1.210114 -0.108432
C  4.816463 -0.317839 -1.032707
C  -1.860025 1.477921 0.939441
C  -1.846426 -1.890958 -1.108272
C  -0.679678 2.497708 -0.931324
C  -1.216281 -1.676746 1.229399
C  -2.482341 2.715549 1.218703
C  -2.677164 -2.987913 -0.785264
C  -1.306231 3.73317 -0.657538
C  -2.040059 -2.77585 1.556695
C  -2.210927 3.850088 0.421549
C  -2.782313 -3.43515 0.550589
H  1.000412 -0.113968 1.311678
H  1.651666 2.059541 0.29371
H  2.259058 1.217011 -1.156615
H  2.056299 -1.411565 -1.27932
H  1.309862 -2.285352 0.078895
H  4.149346 1.78038 0.424527
H  3.311611 0.926295 1.748947
H  3.120911 -1.569084 1.633871
H  3.825671 -2.414492 0.228766
H  5.393714 -1.250837 -1.167254
H  5.524462 0.52926 -1.088343
H  4.110597 -0.228774 -1.89388
H  -0.726015 0.321293 -2.415121
H  -2.111187 0.608441 1.552976
H  -1.748642 -1.588738 -2.155615
H  0.030791 2.421452 -1.760905
H  -0.641201 -1.195181 2.028209
H  -3.188314 2.78825 2.053893
H  -3.23447 -3.497471 -1.579674
H  -1.083951 4.603919 -1.285084
H  -2.098887 -3.117368 2.596499
H  -2.699283 4.807438 0.635085
H  -3.422953 -4.287684 0.802082
