program: Gaussian 09
title: 000201434
version: EM64L-G09RevD.01
frameworkgroup: C1[X(C4H4O6)]
method: RPBEPBE
basis: SDD
operation: Freq
keyword: #p
keyword: freq=noraman
keyword: PBEPBE/SDD
title: #p freq=noraman PBEPBE/SDD
converged: NO YES NO NO
title: Mulliken charges:
elementType: O O O O O O C C C C H H H H
charge: -0.500181 -0.500219 -0.472217 -0.383868 -0.383862 -0.472202 -0.199091 -0.199200 0.086154 0.086118 0.146554 0.146542 0.322723 0.322749
chargesum: -2.00000
title: Mulliken charges with hydrogens summed into heavy atoms:
elementType: O O O O O O C C C C
charge: -0.177458 -0.177470 -0.472217 -0.383868 -0.383862 -0.472202 -0.052537 -0.052658 0.086154 0.086118
polarizability: 8.30421445e+01 -7.38117794e+00 7.28647192e+01 1.39782403e+00 -2.45165146e+00 4.12855987e+01
1716.lowfreq: -9.8170 -7.9408 -5.5953 -0.0004 -0.0002 0.0007 35.4229 45.9533 71.8726
frequency: 35.4226 45.9208 71.8725 230.1171 290.8579 308.1719 320.1996 356.4526 388.6957 487.1147 519.2971 546.9393 624.7329 706.0363 734.7082 834.7971 893.8359 929.7773 930.5673 996.6438 1029.8622 1042.6487 1178.9265 1214.2990 1218.1225 1262.6386 1277.2368 1300.3534 1470.1765 1489.1620 1575.8153 1614.8868 2673.3733 2689.3676 2832.6328 2853.2075
redmass: 13.0964 13.4458 12.2281 12.8738 11.0801 5.2685 10.6857 7.1785 8.7882 9.6824 6.2852 7.4022 5.7327 6.9571 12.4804 8.8329 2.5968 1.0590 1.3525 6.6262 9.3167 6.0617 1.3009 2.9325 7.7716 1.1681 1.2304 1.6462 2.1693 2.0169 2.2671 1.9560 1.0686 1.0731 1.0773 1.0835
irintensity: 1.9285 0.0000 1.6828 8.7141 0.0001 36.2131 0.0007 26.4043 0.0001 31.6435 0.0000 0.0000 59.7377 13.3145 0.0000 29.3612 0.0004 231.2876 0.7206 0.0001 100.3605 0.0030 24.4960 0.0066 308.4754 18.9150 0.0000 0.0000 1175.0676 0.0013 0.0000 42.9780 0.1138 1347.1081 0.0000 252.5095
temp: 298.150 k
press: 1.00000 atm
elementType: 8 8 8 8 8 8 6 6 6 6 1 1 1 1
symmnumber: 1
zpe: 221158.8 jmol-1
zpe.correction: 0.084235 hartree
zpe.thermalcorrener: 0.093411 hartree
zpe.thermalcorrenthalpy: 0.094355 hartree
zpe.thermalcorrgfe: 0.048120 hartree
zpe.sumelectzpe: -605.424622 hartree
zpe.sumelectthermal: -605.415446 hartree
zpe.sumelectthermalent: -605.414501 hartree
zpe.sumelectthermalfe: -605.460737 hartree
dipole: -0.0014 0.0005 -0.0007
dipole: 0.0016
quadrupole: -128.3724 -88.2126 -59.6626
quadrupole: 3.9433 -2.8560 0.8231
quadrupole: -36.2898 3.8699 32.4199 3.9433 -2.8560 0.8231
hfenergy: -605.5088568 hartree
pointgroup: C01 [X(C4H4O6)]
dipole: 0.0005846 -0.0002224 -0.0000951 debye
dipolederiv: -0.7810152 -0.0367519 -0.0607439 -0.1337374 -0.6215816 0.1046285 0.0834357 0.1170777 -0.8976149 -0.7813275 -0.0370288 -0.0605756 -0.1337705 -0.6216247 0.1045797 0.0836127 0.1171133 -0.8977563 -1.0702799 -0.0287176 -0.0005567 0.0488254 -0.5210648 0.1580556 -0.2598755 0.1445435 -1.2390955 -1.4390228 0.1024157 -0.2005399 0.161698 -0.4665446 0.0404122 -0.0678741 0.0376045 -0.6865513 -1.4391336 0.102207 -0.2004476 0.1616006 -0.4664883 0.0403142 -0.0677389 0.0375233 -0.6865106 -1.0700384 -0.0286636 -0.0004357 0.0490775 -0.5211107 0.158193 -0.2597045 0.1447149 -1.2391214 -0.0648363 -0.0269092 0.1242467 0.0690665 0.5409482 -0.1424172 0.1152996 -0.1248672 0.319403 -0.0647568 -0.0267608 0.1242127 0.0692206 0.5408999 -0.1423647 0.1153246 -0.1247852 0.3195044 1.4933178 -0.178331 0.1713074 -0.3008236 0.07827 -0.1751672 0.2177388 -0.1764543 1.237476 1.4931608 -0.1785525 0.1711585 -0.3010817 0.0783511 -0.175422 0.2178498 -0.1767291 1.2374571 -0.0046474 0.0762639 -0.0041919 0.0314905 -0.3253499 0.006242 0.0175843 -0.0033654 -0.0350637 -0.0046864 0.0762546 -0.0041909 0.0314899 -0.3253968 0.006284 0.0175704 -0.0033121 -0.0350774 0.8663677 0.0921568 -0.0295454 0.1233971 0.3152855 0.0083538 -0.1065929 0.0054694 0.3014466 0.8668981 0.0924173 -0.0296977 0.123547 0.3154066 0.0083083 -0.1066301 0.0054669 0.3015041 unknown
polarizability: 86.9164708|-0.5303136|43.1231358|1.4073448|-7.2990011|67.1528558 unknown
InChI: InChI=1S/C4H4O6/c5-1(3(7)8)2(6)4(9)10/h1-2,5-6H
charge -2 multiplicity 1
14 atoms
O  1.09967 0.13917 1.353926
O  -1.039178 0.668332 -1.714645
O  1.463575 0.974324 -2.224293
O  -3.016374 0.316205 0.261846
O  3.076585 0.491744 -0.62275
O  -1.403779 -0.166891 1.863605
C  0.697298 0.740021 0.087507
C  -0.637014 0.067608 -0.448054
C  1.861759 0.706979 -0.977095
C  -1.801634 0.100769 0.616371
H  0.450639 1.825922 0.221517
H  -0.390426 -1.018324 -0.581937
H  0.173099 -0.064759 1.789348
H  -0.112619 0.871801 -2.150345
