program: Gaussian 09
title: 000201480
version: EM64L-G09RevD.01
frameworkgroup: C1[X(C22H25NO)]
method: RPBEPBE
basis: SDD
operation: Freq
keyword: #p
keyword: freq=noraman
keyword: PBEPBE/SDD
title: #p freq=noraman PBEPBE/SDD
converged: YES YES NO NO
title: Mulliken charges:
elementType: O N C C C C C C C C C C C C C C C C C C C C C C H H H H H H H H H H H H H H H H H H H H H H H H H
charge: -0.280445 -0.059902 -0.399089 -0.395060 -0.391807 -0.363115 -0.369442 -0.408932 0.008333 -0.276558 0.464521 0.366496 -0.314174 -0.059630 -0.449122 -0.387968 -0.344857 -0.421877 -0.225619 -0.230078 -0.229128 -0.218293 -0.241113 -0.247881 0.213678 0.188836 0.193551 0.207094 0.207205 0.191744 0.166428 0.237342 0.211471 0.168020 0.215533 0.235274 0.205084 0.238153 0.217379 0.235108 0.243328 0.258956 0.283452 0.227145 0.223712 0.227519 0.223631 0.229201 0.225895
chargesum: 0.00000
title: Mulliken charges with hydrogens summed into heavy atoms:
elementType: O N C C C C C C C C C C C C C C C C C C C C C C
charge: -0.280445 -0.059902 0.003425 0.005585 0.007142 0.040655 0.010048 0.041875 0.008333 -0.071474 0.464521 0.366496 0.141358 -0.059630 -0.214014 -0.144640 -0.085901 -0.138425 0.001526 -0.006366 -0.001609 0.005338 -0.011912 -0.021986
polarizability: 2.97939708e+02 1.70027923e+01 2.50825705e+02 1.37256264e+01 9.12859244e+00 1.82989476e+02
1716.lowfreq: -7.9192 -3.8305 -0.0005 -0.0004 0.0002 5.1814 12.3499 16.2275 21.4155
frequency: 11.2490 13.8808 21.3082 28.1624 41.1949 42.8202 62.3502 63.9146 86.9355 132.8213 146.3590 180.7061 209.9472 215.2520 232.1500 246.2694 253.4011 287.3486 293.6269 323.2601 340.3275 374.5246 390.8616 395.6063 401.7200 404.2004 449.1604 459.8849 469.1412 505.0278 566.3930 583.7630 607.0196 614.9091 616.7287 650.9859 704.7076 705.7604 739.9640 752.9292 768.5512 799.1152 808.8011 827.5895 851.4927 855.4165 856.3365 860.6484 864.5232 908.0807 915.3656 929.0949 943.4917 961.9934 973.5581 978.6039 984.4197 986.9422 988.2101 990.1755 990.3891 995.9473 998.9871 1000.4030 1025.3564 1027.9275 1045.5973 1078.9583 1079.9054 1083.9238 1096.4369 1122.1632 1147.6261 1153.7221 1170.4591 1172.4373 1179.2338 1182.5798 1185.0261 1189.1509 1191.3423 1200.7439 1210.5173 1250.9758 1264.6459 1267.8059 1271.2713 1282.6285 1289.2266 1317.3955 1329.3829 1334.6797 1334.9336 1341.2675 1349.9557 1365.0700 1368.2740 1382.1357 1386.5081 1389.3373 1434.1496 1441.9270 1447.9779 1453.4800 1463.0136 1463.5566 1468.0031 1469.9175 1479.9387 1481.3044 1483.2583 1591.3932 1594.3705 1610.0573 1614.3085 2288.2927 2810.6746 2814.6070 2829.4867 2896.9041 2921.6954 2967.1165 2974.2018 2986.7003 2988.5708 2995.2076 3016.0390 3033.8381 3042.0874 3048.1796 3056.6572 3109.6544 3119.4807 3126.2353 3127.9280 3137.7431 3141.0119 3149.2941 3157.8858 3164.1349 3177.5147
redmass: 4.3943 4.5854 4.2207 3.8253 3.2112 5.0777 3.7679 4.7434 2.9531 4.5806 2.9277 4.8924 4.3961 4.5789 2.9512 2.1806 3.4558 4.5715 2.0630 4.4357 4.4554 4.4408 1.8285 5.0983 2.8403 2.9266 2.9692 3.4338 3.3665 3.1836 2.6612 3.8225 4.7892 6.3345 6.4118 5.0786 2.0892 1.6679 1.8531 3.7420 2.0288 3.7311 1.4682 3.5373 2.6097 1.2955 1.4730 1.2497 2.8768 2.1985 3.2715 1.6168 1.8488 1.2890 1.8277 1.3921 1.4100 3.4842 1.8361 4.6370 6.0567 2.7023 1.5708 1.3443 2.2292 2.1332 2.2003 1.4236 1.5878 1.6004 2.3843 2.6327 2.3255 1.3007 1.0642 1.0670 1.9141 2.5321 1.1140 1.3156 1.3087 1.2212 1.7138 1.3875 1.2454 1.7206 1.2701 1.3172 1.3552 1.3062 1.3116 1.3064 1.3778 1.4312 1.4843 1.4173 1.5313 7.4827 5.6602 1.4708 2.2198 2.1130 1.0810 1.0908 1.0871 1.0888 1.0963 1.0787 2.2639 2.3043 1.0983 6.2536 6.1354 6.0472 6.0893 11.7873 1.0706 1.0716 1.0690 1.0819 1.0585 1.0626 1.0994 1.0626 1.0610 1.0841 1.0866 1.0955 1.0883 1.1031 1.1035 1.0881 1.0847 1.0859 1.0884 1.0910 1.0940 1.0959 1.0991 1.1014 1.0954
irintensity: 0.0207 0.0971 0.2612 0.0728 0.4592 0.0149 0.2380 0.6197 3.7968 3.0852 3.5357 8.0269 3.6649 0.5319 2.0129 0.9979 2.3515 0.1296 5.1072 1.5735 1.3071 0.4688 2.7624 2.0776 0.0769 0.0915 0.4588 4.4899 0.5786 5.8591 1.6015 4.5201 15.3370 1.9961 0.3136 15.6640 40.4542 58.1154 59.5797 10.4214 43.6316 2.6352 0.0243 4.0987 4.2485 0.2396 2.4818 0.6331 13.1800 1.1374 11.7932 22.9368 4.2781 3.2044 2.3378 0.1134 10.8921 128.1919 21.6845 10.3803 2.5715 68.8139 25.8972 2.6930 5.7772 11.0335 9.2647 7.3580 5.2860 9.2669 25.8601 7.1580 4.2103 9.6818 1.0761 0.2902 25.2163 25.1037 3.4895 5.0655 5.5557 1.8183 8.3878 9.7009 1.6775 11.3188 14.7482 51.3584 3.5050 3.1476 45.5037 12.7605 9.5265 0.8580 1.2303 3.9662 42.9329 0.3829 0.4154 8.8980 14.0659 14.2031 7.8546 4.6185 12.8646 1.9143 12.8566 2.8842 4.9711 26.6371 8.1564 0.8085 0.3890 3.6029 5.5913 7.9305 32.4166 46.3781 216.8270 37.2496 41.1389 40.0785 22.6113 31.2156 34.3477 12.4077 69.1222 71.3046 22.8329 15.6805 92.8657 9.1408 1.8730 0.0036 4.8332 15.2860 34.8969 30.7403 33.0196 25.5336 7.2722
temp: 298.150 k
press: 1.00000 atm
elementType: 8 7 6 6 6 6 6 6 6 6 6 6 6 6 6 6 6 6 6 6 6 6 6 6 1 1 1 1 1 1 1 1 1 1 1 1 1 1 1 1 1 1 1 1 1 1 1 1 1
symmnumber: 1
zpe: 1078499.9 jmol-1
zpe.correction: 0.410779 hartree
zpe.thermalcorrener: 0.433265 hartree
zpe.thermalcorrenthalpy: 0.434209 hartree
zpe.thermalcorrgfe: 0.353880 hartree
zpe.sumelectzpe: -981.471927 hartree
zpe.sumelectthermal: -981.449441 hartree
zpe.sumelectthermalent: -981.448496 hartree
zpe.sumelectthermalfe: -981.528826 hartree
dipole: 0.0546 -1.0279 -0.0433
dipole: 1.0303
quadrupole: -125.5068 -134.4942 -137.8730
quadrupole: 6.4098 7.3063 1.1474
quadrupole: 7.1178 -1.8695 -5.2483 6.4098 7.3063 1.1474
hfenergy: -981.8827057 hartree
pointgroup: C01 [X(C22H25N1O1)]
dipole: 0.0111518 0.2427128 -0.3244589 debye
polarizability: 298.3873537|-21.6618593|213.0315704|4.1060426|-34.2840957|220.3359648 unknown
InChI: InChI=1S/C22H25NO/c1-4-12-20(13-5-1)22(21-14-6-2-7-15-21)24-19-11-10-18-23-16-8-3-9-17-23/h1-2,4-7,12-15,22H,3,8-9,16-19H2
charge 0 multiplicity 1
49 atoms
O  -0.786107 0.089065 -0.037067
N  4.843704 0.276356 -0.89491
C  7.167756 -0.247448 0.829445
C  5.75739 0.010429 1.408248
C  7.306935 0.435206 -0.550499
C  4.667857 -0.419385 0.40637
C  6.172419 -0.00729 -1.495978
C  3.753968 -0.043019 -1.855769
C  2.419165 0.395224 -1.412169
C  -2.126736 0.512085 0.430132
C  -3.037929 0.878227 -0.742591
C  -2.671133 -0.625015 1.301624
C  -0.054922 1.193922 -0.69754
C  1.283097 0.738775 -1.077331
C  -3.619939 2.164906 -0.833681
C  -4.039767 -0.63288 1.67224
C  -3.295564 -0.071223 -1.764328
C  -1.817608 -1.6442 1.789413
C  -4.457989 2.501062 -1.92315
C  -4.54716 -1.640689 2.521134
C  -4.124205 0.263089 -2.85565
C  -2.32892 -2.657268 2.632732
C  -4.711116 1.549991 -2.936968
C  -3.692492 -2.658641 3.005054
H  7.946666 0.12085 1.52367
H  7.32501 -1.340583 0.716897
H  5.617587 -0.538983 2.359029
H  5.636054 1.089687 1.62255
H  7.255314 1.533983 -0.425808
H  8.284226 0.1935 -1.011124
H  4.708471 -1.53442 0.270802
H  3.664095 -0.170912 0.794905
H  6.244805 0.537996 -2.456564
H  6.290888 -1.102071 -1.722596
H  3.703192 -1.143534 -2.075363
H  3.993383 0.456723 -2.81558
H  -2.00654 1.420483 1.068175
H  -0.614601 1.531598 -1.595519
H  0.017909 2.056786 0.002477
H  -3.417797 2.907134 -0.050123
H  -4.711228 0.143914 1.287693
H  -2.836996 -1.064071 -1.695476
H  -0.765183 -1.635818 1.493982
H  -4.905764 3.499469 -1.982126
H  -5.60713 -1.634658 2.799748
H  -4.31681 -0.475707 -3.641836
H  -1.66074 -3.44476 3.000058
H  -5.357226 1.807439 -3.783833
H  -4.085787 -3.443724 3.660901
