program: Gaussian 09
title: 000201449
version: EM64L-G09RevD.01
frameworkgroup: C1[X(C12H15Cl2NO2)]
method: RPBEPBE
basis: SDD
operation: Freq
keyword: #p
keyword: freq=noraman
keyword: PBEPBE/SDD
title: #p freq=noraman PBEPBE/SDD
converged: YES YES NO NO
title: Mulliken charges:
elementType: Cl Cl O O N C C C C C C C C C C C C H H H H H H H H H H H H H H H
charge: -0.076731 -0.063307 -0.441570 -0.259678 -0.241051 0.423358 -0.345135 -0.315686 0.093625 -0.597113 0.482492 -0.566480 -0.595653 -0.318678 -0.374160 -0.806016 0.095501 0.226492 0.243441 0.248462 0.250005 0.243884 0.289594 0.272747 0.259179 0.269378 0.279281 0.239424 0.227995 0.237504 0.235134 0.383762
chargesum: 0.00000
title: Mulliken charges with hydrogens summed into heavy atoms:
elementType: Cl Cl O O N C C C C C C C C C C C C
charge: -0.076731 -0.063307 -0.057809 -0.259678 -0.241051 0.423358 0.124799 0.182781 0.093625 -0.353229 0.482492 -0.004139 -0.067096 -0.039397 -0.134736 -0.105383 0.095501
polarizability: 2.14916894e+02 -4.68429962e+00 1.53181774e+02 -1.22765112e+01 -2.55726083e+01 1.53448903e+02
1716.lowfreq: -3.4821 -0.0025 -0.0017 0.0006 4.1573 6.6069 28.9226 30.5438 41.3346
frequency: 28.8192 30.4949 41.3056 48.4440 49.1640 75.4731 79.5525 88.5020 100.2871 145.9835 180.2634 200.2035 228.6173 230.8816 234.8266 263.0018 314.0579 344.6953 358.6669 409.9554 429.7221 452.1743 529.2611 551.1224 573.8007 586.3623 599.4814 666.2913 677.8522 683.3118 707.7070 713.6173 761.6204 772.6934 779.5790 833.6269 875.1587 888.9052 962.1770 983.4570 991.6349 995.7936 1006.1413 1027.6940 1035.4764 1046.3255 1052.2310 1107.7324 1121.4207 1163.8717 1169.8305 1205.5569 1222.4388 1248.1087 1251.0407 1264.6321 1283.4080 1291.0695 1307.7818 1339.3610 1352.9817 1359.6520 1385.7376 1397.3827 1424.0494 1443.8997 1450.7252 1464.5519 1467.2736 1472.1623 1477.1422 1490.3760 1553.1803 1613.0138 1621.8454 2980.0984 3018.4962 3023.3723 3058.8888 3058.9756 3074.9935 3080.6108 3089.9212 3110.4437 3135.2783 3138.1668 3147.2347 3163.3846 3179.4398 3527.9001
redmass: 6.5856 9.6365 5.3723 1.1501 6.1380 2.4165 4.6414 3.1463 3.7613 3.2817 6.0500 5.2568 5.2193 4.7873 4.2901 4.5671 3.1958 4.0327 4.0034 5.5154 4.4898 3.6858 3.7095 4.4756 3.4176 1.4290 3.8998 6.5314 4.1210 5.6928 4.9133 4.7182 1.4592 1.2176 2.2108 1.4012 4.4227 1.4897 2.1413 1.4227 1.5631 3.3301 1.4545 2.6610 2.6941 1.6117 2.9892 1.6477 1.6508 1.5136 1.6104 1.9301 2.4538 1.1600 1.1669 1.4653 1.5255 1.2279 2.4001 1.4813 1.3932 1.4486 5.8086 1.2366 2.7662 1.0846 1.0959 1.0990 1.0488 1.1133 1.3162 2.3546 6.3024 6.8350 7.1156 1.0374 1.0619 1.0639 1.0604 1.0930 1.0591 1.1022 1.0991 1.0988 1.0902 1.0907 1.1113 1.1119 1.0947 1.0641
irintensity: 0.1215 0.9780 0.6955 0.6377 0.1172 1.9914 2.9004 0.2463 1.3160 2.8891 4.1162 8.7485 0.8517 3.9823 0.7902 3.3708 2.6204 5.3865 7.9163 9.8672 11.5858 23.3530 26.9930 36.1382 25.9843 61.0100 8.6498 52.6003 49.1452 90.5813 26.3253 6.7699 7.9903 9.2885 2.2197 35.0505 1.8903 4.0629 92.8088 16.9568 48.6703 164.8283 8.7969 30.3665 5.4383 15.2451 4.2095 57.9458 100.3736 84.5306 19.4362 28.4875 5.9168 14.4431 5.4059 1.6099 36.5104 5.7029 72.3681 18.1984 6.4800 1.4624 9.3001 12.8581 60.0692 5.6923 0.9248 30.1438 12.8242 7.6380 12.0807 121.1517 70.8015 31.7278 408.9565 25.3231 18.9738 11.3799 17.3275 17.0551 9.1490 12.8620 17.1108 2.0548 16.7757 6.0714 18.1245 9.2382 3.7114 53.0805
temp: 298.150 k
press: 1.00000 atm
elementType: 17 17 8 8 7 6 6 6 6 6 6 6 6 6 6 6 6 1 1 1 1 1 1 1 1 1 1 1 1 1 1 1
symmnumber: 1
zpe: 654200.9 jmol-1
zpe.correction: 0.249172 hartree
zpe.thermalcorrener: 0.267650 hartree
zpe.thermalcorrenthalpy: 0.268594 hartree
zpe.thermalcorrgfe: 0.199122 hartree
zpe.sumelectzpe: -1590.320947 hartree
zpe.sumelectthermal: -1590.302469 hartree
zpe.sumelectthermalent: -1590.301525 hartree
zpe.sumelectthermalfe: -1590.370997 hartree
dipole: 4.1586 -0.2062 -1.4556
dipole: 4.4108
quadrupole: -114.5795 -130.4763 -105.8732
quadrupole: -0.2363 -2.4774 -8.9535
quadrupole: 2.3968 -13.4999 11.1031 -0.2363 -2.4774 -8.9535
hfenergy: -1590.5701189 hartree
pointgroup: C01 [X(C12H15Cl2N1O2)]
dipole: -1.6993125 -0.1646034 -0.3108973 debye
polarizability: 216.7468213|4.9445648|166.4890956|-0.2730925|22.0992835|138.3116541 unknown
InChI: InChI=1S/C12H15Cl2NO2/c1-9-2-3-10(12(16)17)11(8-9)15(6-4-13)7-5-14/h2-3,8,16H,4-7H2,1H3
charge 0 multiplicity 1
32 atoms
Cl 2.912134 -3.524318 1.088402
Cl 3.361609 2.494991 -2.474942
O  -0.803722 2.474396 2.408171
O  1.087848 1.2120 1.986196
N  0.948244 -0.257976 -0.54883
C  -0.436405 -0.147376 -0.253269
C  1.623748 -1.567596 -0.449391
C  1.80298 0.928918 -0.744379
C  -0.967606 0.796371 0.694553
C  -1.35129 -0.984571 -0.95555
C  -2.748003 -0.874897 -0.802842
C  1.983591 -1.873107 1.01872
C  2.206669 1.014874 -2.228448
C  -2.383303 0.941786 0.800905
C  -3.259024 0.12818 0.071351
C  -3.69414 -1.768498 -1.582086
C  -0.110375 1.474746 1.694004
H  2.546325 -1.55861 -1.056059
H  0.983525 -2.375894 -0.842716
H  2.698156 0.899355 -0.097112
H  1.251444 1.841507 -0.475945
H  -0.949451 -1.697193 -1.684669
H  2.654141 -1.121951 1.457368
H  1.091751 -2.002789 1.648047
H  2.778657 0.140665 -2.573771
H  1.340259 1.195074 -2.881422
H  -2.772188 1.683574 1.503159
H  -4.342207 0.252608 0.181475
H  -3.152385 -2.45181 -2.257526
H  -4.307016 -2.385064 -0.897724
H  -4.396097 -1.170477 -2.192597
H  -0.188665 2.839187 3.099627
